{"text_format":"3","workbook":"xlsx","n_sheets":11,"sheets":["Erläuterungen","BB Teil I Verpflichtung","BB Teil II Allgemein","Betriebsstätten","Landwirtschaft","Verarbeitung","Import","Handel","Futtermittel","Bestätigung der Angaben","Dropdowns"],"not_rendered":{"images":2,"defined_names":7},"read":"whole","date_system":"1900"}

{"sheet":"Erläuterungen","index":0,"n_rows":8,"n_cols":3,"rows_kept":8,"merged":[[1,0,1,9],[2,0,2,1],[2,2,2,9],[3,0,3,1],[3,2,3,9],[4,0,4,1],[4,2,4,9],[5,0,5,1],[5,2,5,9],[6,0,6,1],[6,2,6,9],[7,0,7,1],[7,2,7,9]]}
[]
["INFORMATION: Wichtige Hinweise zur Aktualität der Betriebsbeschreibung"]
["Gesetzliche Anforderung",null,"VO (EU) 2018/848 ergänzt durch DVO (EU) 2021/2119 Art. 3 sowie VO (EU) 2017/625"]
["Jährliche Kontrolle",null,"Sie erhalten mit der Terminbestätigung immer die Vorlage der Betriebsbeschreibung in ihrer aktuellen Dokumentenversion. Überprüfen Sie dann, ob die Version unserer Vorlage mit der von Ihnen ausgefüllten Version übereinstimmt. Die Angabe zur Dokumentenversion finden Sie in der Fußzeile des Dokuments. Sollte die von uns übersandte Vorlage einen höheren Versionsstand aufweisen, dann verwenden Sie ausschließlich dieses Dokument zur Aktualisierung der Betriebsbeschreibung. Diese Betriebsbeschreibung ist bei der Kontrolle vorzulegen. \n\n"]
["Laufende Aktualisierung",null,"Sollten sich im Unternehmen meldepflichtige Änderungen ergeben, die eine Anpassung der Betriebsbeschreibung erfordern, kontaktieren Sie die Kiwa BCS Öko-Garantie GmbH. Wir stellen Ihnen dann die aktuelle Vorlagenversion zur Verfügung.\nErläuterungen zu meldepflichtigen Änderungen entnehmen Sie bitte dem Dokument \"D-DE_08-020_Leitfaden Standardkontrollverfahren und Serviceprotokoll-Kunden\" Kapitel 2.2"]
["Neukunden",null,"Sie erhalten die (digitale) Vorlage der Betriebsbeschreibung mit der Terminbestätigung der Erstkontrolle."]
["Ausfüllhinweise",null,"Die gelb gekennzeichneten Felder sind beschreibbar. Sobald ein von Ihnen ausgefülltes Feld mit Inhalt versehen ist, wechselt es die Farbe zu weiß und der von Ihnen durchgeführte Eintrag erscheint in blau. Das Feld ist jederzeit wieder beschreibbar.\nBitte füllen Sie die Betriebsbeschreibung vollständig und richtig und dem aktuellen Stand entsprechend aus.\nAn vielen Stellen der Betriebsbeschreibung finden Sie Dropdownmenüs, um Ihnen die Eingabe zu erleichtern: \n\nWenn Sie auf dieses Icon drücken, erscheint eine Auswahl an Antwortmöglichkeiten. Die ausgewählte Antwort kann dann ggf. im entsprechenden Kommentarfeld bzw. in einem dazu gehörigen Anhang erläutert werden.\n\nJede Frage in der Betriebsbeschreibung hat eine Nummer. Bitte verwenden Sie diese Nummern, um Ihre Anhänge zu ordnen. Wenn Sie mehrere Anhänge zu einer Frage haben, bitte dann die Fragenummer um \".1\", \".2\", etc. ergänzen.\nDies erleichtert uns die Zuordnung der von Ihnen beigefügten Anhänge zu Ihrer Betriebsbeschreibung.\nBeispiel: Sie fügen zwei Anhänge an die Frage 0.2 an, dann tragen Sie bitte in die Spalte <Anhänge> in der Zeile der Frage 0.2 ein: 0.2.1, 0.2.2\n\nAnsonsten sind die Felder der Betriebsbeschreibung selbsterklärend."]
["Formatierungshinweise",null,"Damit Sie die einzelnen Seiten der Verpflichtungserklärung und der Betriebsbeschreibung in pdfs mit sinnvollen Seitenumbrüchen umwandeln bzw. mit sinnvollen Seitenumbrüchen ausdrucken können, haben wir Ihnen die Option gelassen, sowohl Zeilenhöhen als auch Spaltenbreiten zu verändern.\n\nDarüber hinaus können Sie die Größe des Ausdrucks insgesamt so anpassen, dass sinnvolle Seitenumbrüche entstehen, indem Sie in der Menüleiste von Excel oben auf <Seitenlayout> klicken und dann in dem kleinen Fenster in der Mitte die Skalierung des Ausdrucks einstellen:\n\n\n\n\n\n\n\nDie Standardeinstellung durch uns ist 55% ."]

{"sheet":"BB Teil I Verpflichtung","index":1,"n_rows":44,"n_cols":4,"rows_kept":44,"merged":[[0,0,0,5],[1,0,1,5],[2,0,2,5],[3,0,3,1],[3,3,3,4],[4,0,4,1],[4,3,4,4],[5,0,5,1],[5,3,5,4],[6,0,6,1],[6,3,6,4],[7,0,7,1],[8,0,8,5],[9,0,9,5],[10,0,10,5],[11,2,11,5],[12,2,12,5],[13,2,13,5],[14,0,14,5],[15,2,15,5],[16,1,16,5],[17,1,17,5],[18,0,18,5],[19,1,19,5],[20,1,20,5],[21,1,21,5],[23,0,23,5],[24,1,24,5],[25,1,25,5],[26,1,26,5],[27,1,27,5],[28,1,28,5],[29,1,29,5],[30,1,30,5],[31,1,31,5],[32,1,32,5],[33,0,33,5],[35,0,35,1],[35,3,35,4],[37,0,37,5],[38,0,38,1],[38,3,38,5],[39,3,39,5],[41,0,41,5],[42,0,42,1],[42,3,42,5],[43,3,43,5]]}
["Betriebsbeschreibung gemäß Verordnung (EU) 2018/848 \nKontrollvorschriften gemäß VO (EU) 2018/848 Art. 39 sowie VO (EU) 2017/625 Art. 15\n"]
["Teil I Verpflichtungserklärung"]
["Kontrollpflichtiges/r Unternehmen/r, nachstehend \"Unternehmer\" genannt"]
["Name des Unternehmens (amtlich gemeldet, Hauptsitz)",null,null,"Handelsregisternummer (HR-Nr.)"]
["Rechtsform des Unternehmens",null,null,"Vertretungsberechtigt(e) laut HR"]
["Sonstige Rechtsform (nicht in obiger Auswahl)",null,null,"Umsatzsteueridentnr. / Steuernr."]
["Straße, Hausnummer",null,null,"Sonstiger Hinweis"]
["PLZ, Ort"]
["Die Unterzeichnung des Teils I der Betriebsbeschreibung durch den verantwortlichen Unternehmer / die verantwortliche Unternehmerin ist verpflichtend! Darüberhinaus ist die Vollständigkeit, Richtigkeit und Aktualität der Betriebsbeschreibung im Register <Bestätigung der Angaben>  per Unterschrift durch den verantwortlichen Unternehmer / die verantwortliche Unternehmerin oder eine dazu befugte Person zu bestätigen, um die Anforderungen gemäß Öko-Verordnung zu erfüllen."]
["Hiermit erklärt der/die Unternehmer*in, dass sämtliche Teile dieser Betriebsbeschreibung vollständig und wahrheitsgemäß erstellt und ausgefüllt wurden. Alle geforderten und notwendigen Unterlagen wurden der Betriebsbeschreibung beigefügt. Änderungen werden der Kontrollstelle fristgerecht mitgeteilt."]
{"$rows_left_out":35}
{"sheet":"BB Teil II Allgemein","index":2,"n_rows":108,"n_cols":12,"rows_kept":108,"merged":[[0,0,0,8],[1,0,1,8],[2,2,2,3],[2,5,2,8],[3,2,3,3],[3,5,3,8],[4,2,4,3],[4,5,4,8],[5,0,5,8],[6,0,6,8],[7,0,7,1],[7,2,7,4],[7,5,7,6],[7,7,7,8],[8,0,8,1],[8,2,8,4],[8,5,8,6],[8,7,8,8],[9,0,9,1],[9,2,9,4],[9,5,9,6],[9,7,9,8],[10,0,10,1],[10,2,10,4],[10,5,10,6],[10,7,10,8],[11,0,11,1],[11,2,11,4],[11,5,11,6],[11,7,11,8],[12,0,12,1],[12,2,12,4],[12,5,12,6],[12,7,12,8],[13,0,13,1],[13,2,13,4],[13,5,13,6],[13,7,13,8],[14,0,14,1],[14,2,14,4],[15,0,15,1],[15,2,15,4],[16,0,16,1],[16,7,16,8],[17,0,17,1],[17,7,17,8],[18,0,18,1],[18,7,18,8],[20,0,20,1],[20,3,20,4],[20,5,20,6],[21,0,21,1],[21,3,21,4],[21,5,21,6],[22,0,22,1],[22,3,22,4],[22,5,22,6],[23,0,23,1],[23,3,23,4],[23,5,23,6],[24,1,24,7],[25,1,25,2],[25,3,25,7],[26,1,26,2],[26,3,26,7],[27,1,27,2],[27,3,27,7],[28,1,28,2],[28,3,28,7],[29,1,29,2],[29,3,29,7],[30,0,30,8],[31,0,31,2],[31,3,31,8],[32,0,32,2],[32,5,32,8],[33,0,33,2],[33,5,33,8],[34,0,34,2],[34,5,34,8],[35,0,35,2],[35,5,35,8],[36,0,36,2],[36,5,36,8],[37,0,37,2],[37,5,37,8],[38,0,38,2],[38,3,38,8],[39,0,39,2],[39,3,39,8],[40,0,40,2],[40,3,40,8],[42,0,42,7],[43,0,43,1],[43,2,43,3],[43,4,43,8],[44,0,44,1],[44,2,44,3],[44,4,44,8],[45,0,45,1],[45,2,45,3],[45,4,45,8],[46,0,46,1],[46,2,46,3],[46,4,46,8],[47,0,47,1],[47,2,47,3],[47,4,47,8],[48,0,48,1],[48,2,48,3],[48,4,48,8],[49,0,49,1],[49,2,49,3],[49,4,49,8],[50,0,50,1],[50,2,50,3],[50,4,50,8],[51,0,51,8],[52,5,52,6],[53,1,53,7],[54,1,54,3],[54,5,54,6],[55,1,55,8],[56,1,56,3],[56,5,56,6],[57,1,57,3],[57,5,57,6],[58,1,58,3],[58,5,58,6],[59,1,59,8],[60,1,60,3],[60,5,60,6],[61,1,61,3],[61,5,61,6],[62,1,62,3],[62,5,62,6],[63,1,63,3],[63,5,63,6],[64,1,64,8],[65,1,65,3],[65,5,65,6],[66,1,66,3],[66,5,66,6],[67,1,67,3],[67,5,67,6],[68,1,68,3],[68,5,68,6],[69,1,69,3],[69,5,69,6],[70,1,70,3],[70,5,70,6],[71,1,71,3],[71,5,71,6],[72,1,72,8],[73,1,73,3],[73,5,73,6],[74,1,74,3],[74,5,74,6],[75,1,75,3],[75,5,75,6],[76,1,76,3],[76,5,76,6],[77,1,77,3],[77,5,77,6],[78,1,78,8],[79,1,79,3],[79,5,79,6],[80,1,80,3],[80,5,80,6],[81,5,81,6],[82,1,82,3],[82,5,82,6],[83,1,83,3],[83,5,83,6],[84,1,84,3],[84,5,84,6],[85,1,85,8],[86,1,86,3],[86,5,86,6],[87,1,87,3],[87,5,87,6],[88,1,88,3],[88,5,88,6],[89,6,89,7],[90,6,90,7],[91,6,91,7],[92,6,92,7],[93,2,93,4],[93,5,93,6],[94,2,94,4],[94,5,94,6],[95,1,95,7],[96,1,96,3],[96,5,96,6],[97,1,97,3],[97,5,97,6],[98,1,98,3],[98,5,98,6],[99,1,99,3],[99,5,99,6],[100,1,100,8],[101,1,101,3],[101,5,101,6],[102,1,102,8],[103,1,103,3],[103,5,103,6],[104,1,104,8],[105,0,106,8],[107,0,107,1],[107,4,107,5],[107,7,107,8],[108,0,108,1],[108,4,108,5],[108,7,108,8],[109,0,109,1],[109,4,109,5],[109,7,109,8],[110,0,110,1],[110,4,110,5],[110,7,110,8],[111,0,111,1],[111,4,111,5],[111,7,111,8],[112,0,112,1],[112,4,112,5],[112,7,112,8]]}
["Betriebsbeschreibung gemäß Verordnung (EU) 2018/848 \nKontrollvorschriften gemäß VO (EU) 2018/848 Art. 39 sowie VO (EU) 2017/625 Art. 15"]
["Teil II Beschreibung des Unternehmens"]
[null,null,"Landwirtschaftliche Produktion (Erzeugung)",null,null,"Vergabe von Tätigkeiten an Dritte: Subunternehmer sind im Formular der Amtlichen Meldung zu erfassen"]
[null,null,"Herstellung (Aufbereitung / Verarbeitung / Lagerung) verarbeiteter Lebensmittel ",null,null,"Herstellung (Aufbereitung) von Futtermitteln"]
[null,null,"Handel mit Drittländern (Import)",null,null,"Vertrieb und Vermarktung (einschließlich Onlinehandel) ACHTUNG: BITTE NUR AUSWÄHLEN BEI AUSSCHLIESSLICHEM INVERKEHRBRINGEN UND VERTRIEB!"]
["Antworten: Es sind alle Fragen zu beantworten (ggf. mit \"nicht relevant\", \"nicht zutreffend\", o.ä.)"]
["Unternehmens- und Kontaktdaten"]
["Name des Unternehmens (amtlich gemeldet, Hauptsitz)",null,{"$f":"IF('BB Teil I Verpflichtung'!C4=0,\"\",'BB Teil I Verpflichtung'!C4)","v":""},null,null,"Handelsregisternummer (HR-Nr.)",null,{"$f":"IF('BB Teil I Verpflichtung'!F4=0,\"\",'BB Teil I Verpflichtung'!F4)","v":""}]
["Rechtsform des Unternehmens",null,{"$f":"IF('BB Teil I Verpflichtung'!C5=0,\"\",'BB Teil I Verpflichtung'!C5)","v":""}]
["Straße, Hausnummer",null,{"$f":"IF('BB Teil I Verpflichtung'!C7=0,\"\",'BB Teil I Verpflichtung'!C7)","v":""},null,null,"Vertretungsberechtigt(e) laut HR",null,{"$f":"IF('BB Teil I Verpflichtung'!F5=0,\"\",'BB Teil I Verpflichtung'!F5)","v":""}]
{"$rows_left_out":99}
{"sheet":"Betriebsstätten","index":3,"n_rows":30,"n_cols":3,"rows_kept":30,"merged":[[0,0,0,8],[1,0,1,8],[2,0,2,8],[3,0,3,1],[3,2,3,8],[4,0,4,1],[5,0,5,1],[6,0,6,1],[7,0,7,1],[8,0,8,1],[9,0,9,1],[10,0,10,1],[11,0,11,1],[12,0,12,1],[13,0,13,1],[14,0,14,8],[15,0,29,0]]}
["Betriebsbeschreibung gemäß Verordnung (EU) 2018/848 \nKontrollvorschriften gemäß VO (EU) 2018/848 Art. 39 sowie VO (EU) 2017/625 Art. 15\n"]
["Teil II Beschreibung der Betriebsstätte/n / Betriebseinheit/en / Filiale/n"]
["Unternehmens- und Kontaktdaten"]
["Name des Unternehmens (amtlich gemeldet, Hauptsitz)",null,{"$f":"CONCATENATE('BB Teil II Allgemein'!C8,\" \",'BB Teil II Allgemein'!C9)","v":" "}]
["Name Betriebsstätte / Einheiten / Filialen"]
["Straße, Hausnummer"]
["PLZ, Ort"]
["Bundesland"]
["Verantwortliche Person/en "]
["Telefon"]
{"$rows_left_out":21}
{"sheet":"Landwirtschaft","index":4,"n_rows":33,"n_cols":9,"rows_kept":33,"merged":[[0,0,0,8],[1,0,1,1],[1,2,1,4],[1,5,1,6],[1,7,1,8],[2,0,2,8],[3,0,3,1],[3,3,3,4],[3,6,3,8],[4,0,4,1],[4,3,4,4],[4,6,6,8],[5,0,5,1],[5,3,5,4],[6,0,6,1],[6,3,6,4],[7,0,7,1],[7,7,7,8],[8,0,8,1],[8,7,8,8],[9,0,9,1],[9,7,9,8],[10,0,10,1],[10,7,10,8],[11,0,11,1],[11,7,11,8],[13,0,13,7],[14,0,14,2],[14,3,14,7],[15,0,15,2],[15,3,15,7],[16,0,16,2],[16,3,16,4],[16,5,16,7],[17,0,17,2],[17,3,17,4],[17,5,17,7],[18,0,18,2],[18,3,18,7],[19,0,19,2],[19,3,19,7],[20,0,20,2],[20,3,20,7],[21,0,21,2],[21,3,21,7],[23,5,23,6],[24,1,24,6],[25,1,25,3],[25,5,25,6],[26,1,26,3],[26,5,26,6],[27,1,27,3],[27,5,27,6],[28,1,28,3],[28,5,28,6],[29,1,29,3],[29,5,29,6],[30,1,30,3],[30,5,30,6],[31,1,31,8],[32,1,32,3],[32,5,32,6]]}
["Betriebsbeschreibung gemäß Verordnung (EU) 2018/848 \nKontrollvorschriften gemäß VO (EU) 2018/848 Art. 39 sowie VO (EU) 2017/625 Art. 15\nLANDWIRTSCHAFT\n"]
["Name des Unternehmens (amtlich gemeldet, Hauptsitz)",null,{"$f":"CONCATENATE('BB Teil II Allgemein'!C8,\" \",'BB Teil II Allgemein'!C9)","v":" "},null,null,"Identifikationsnummer Betriebsnummer (InVeKoS) sowie Personen-Ident (lt. Landwirtschaftsamt) (sofern vorhanden)"]
["Antworten - Es sind alle Fragen zu beantworten (ggf. mit \"nicht relevant\", \"nicht zutreffend\", o.ä)"]
["Tierhaltung",null,null,"Dauerkulturen",null,null,"Haupterzeugnisse"]
["Grünlandbetrieb/Futterbau",null,null,"Gartenbau"]
["Marktfruchtbetrieb",null,null,"Sammlung von Wildpflanzen"]
["Veredelungsbetrieb",null,null,"Sonstiges"]
["Verantwortliche Person(en) für",null,"Vor- und Nachname","Telefon  ","Mobil","E-Mail","Qualifikation","Bemerkungen"]
["Pflanzenproduktion"]
["Tierproduktion"]
{"$rows_left_out":24}
{"sheet":"Verarbeitung","index":5,"n_rows":54,"n_cols":9,"rows_kept":54,"merged":[[0,0,0,8],[1,0,1,8],[2,0,2,1],[2,2,2,8],[3,0,3,1],[3,7,3,8],[4,0,4,1],[4,7,4,8],[5,0,5,1],[5,7,5,8],[6,0,6,1],[6,7,6,8],[7,0,7,1],[7,7,7,8],[8,0,8,1],[8,7,8,8],[9,0,9,1],[9,7,9,8],[10,0,10,1],[10,7,10,8],[11,0,11,1],[11,7,11,8],[12,0,12,1],[12,7,12,8],[13,0,13,1],[13,7,13,8],[14,0,14,1],[14,7,14,8],[15,0,15,1],[15,7,15,8],[16,0,16,1],[16,7,16,8],[17,0,17,1],[17,7,17,8],[18,0,18,1],[18,7,18,8],[19,0,19,7],[20,0,20,2],[20,3,20,7],[21,0,21,2],[21,3,21,7],[22,0,22,2],[22,3,22,7],[23,0,23,2],[23,3,23,7],[24,0,24,8],[25,5,25,6],[26,1,26,6],[27,1,27,3],[27,5,27,6],[28,1,28,3],[28,5,28,6],[29,1,29,3],[29,5,29,6],[30,1,30,3],[30,5,30,6],[31,1,31,3],[31,5,31,6],[32,1,32,8],[33,1,33,3],[33,5,33,6],[34,1,34,3],[34,5,34,6],[35,1,35,8],[36,1,36,3],[36,5,36,6],[37,1,37,3],[37,5,37,6],[38,1,38,3],[38,5,38,6],[45,5,45,7],[46,1,46,3],[46,5,46,7],[47,1,47,3],[47,5,47,7],[48,1,48,3],[48,5,48,7],[49,3,49,4],[50,3,50,4],[51,3,51,4],[52,3,52,4],[53,3,53,4]]}
["Betriebsbeschreibung gemäß Verordnung (EU) 2018/848 \nKontrollvorschriften gemäß VO (EU) 2018/848 Art. 39 sowie VO (EU) 2017/625 Art. 15\nVERARBEITUNG"]
["Antworten - Es sind alle Fragen zu beantworten (ggf. mit \"nicht relevant\", \"nicht zutreffend\", o.ä)"]
["Name des Unternehmens (amtlich gemeldet, Hauptsitz)",null,{"$f":"IF('BB Teil I Verpflichtung'!$C$4=0,\"\",CONCATENATE('BB Teil I Verpflichtung'!$C$4,\" \",'BB Teil I Verpflichtung'!$C$5))","v":""}]
["Verantwortliche Person(en) für",null,"Vor- und Nachname","Telefon  ","Mobil","E-Mail","Qualifikation","Bemerkungen"]
["Qualitätsmanagement"]
["Buchhaltung"]
["Einkauf"]
["Prüfung Spezifikationen"]
["Warenannahme und Wareneingangskontrolle"]
["Führung Lagerbücher / Bestandsverwaltung"]
{"$rows_left_out":45}
{"sheet":"Import","index":6,"n_rows":23,"n_cols":9,"rows_kept":23,"merged":[[0,0,0,8],[1,0,1,8],[2,0,2,8],[3,0,3,1],[3,2,3,8],[4,0,4,1],[4,7,4,8],[5,0,5,1],[5,7,5,8],[6,0,6,1],[6,7,6,8],[7,0,7,1],[7,7,7,8],[9,0,9,7],[10,0,10,2],[10,3,10,7],[11,0,11,2],[11,3,11,7],[12,0,12,8],[13,5,13,6],[14,1,14,6],[15,1,15,3],[15,5,15,6],[16,1,16,3],[16,5,16,6],[17,1,17,3],[17,5,17,6],[18,1,18,3],[18,5,18,6],[19,1,19,3],[19,5,19,6],[20,1,20,3],[20,5,20,6],[21,1,21,3],[21,5,21,6],[22,1,22,3],[22,5,22,6]]}
["Betriebsbeschreibung gemäß Verordnung (EU) 2018/848 \nKontrollvorschriften gemäß VO (EU) 2018/848 Art. 39 sowie VO (EU) 2017/625 Art. 15\nIMPORT"]
[null,null,{"$f":"IF('BB Teil I Verpflichtung'!C4=0,\"\",'BB Teil I Verpflichtung'!C4)","v":""}]
["Antworten - Es sind alle Fragen zu beantworten (ggf. mit \"nicht relevant\", \"nicht zutreffend\", o.ä)"]
["Name des Unternehmens (amtlich gemeldet, Hauptsitz)",null,{"$f":"IF('BB Teil I Verpflichtung'!$C$4=0,\"\",CONCATENATE('BB Teil I Verpflichtung'!$C$4,\" \",'BB Teil I Verpflichtung'!$C$5))","v":""}]
["Verantwortliche Person(en) für",null,"Vor- und Nachname","Telefon  ","Mobil","E-Mail","Qualifikation","Bemerkungen"]
["Importe"]
["Weitere verantwortliche Personen"]
["Weitere verantwortliche Personen"]
[]
["Mindestanforderung vorzulegende Anlagen und Informationen (Angaben können im Grundrssplan und / oder in Dokumenten in Anlagen gemacht werden)  PFLICHTDOKUMENTE ",{"$nulls":7},"Anlagenr. einfügen"]
{"$rows_left_out":14}
{"sheet":"Handel","index":7,"n_rows":25,"n_cols":9,"rows_kept":25,"merged":[[0,0,0,8],[1,0,1,8],[2,0,2,8],[3,0,3,1],[3,2,3,8],[4,0,4,1],[4,7,4,8],[5,0,5,1],[5,7,5,8],[6,0,6,1],[6,7,6,8],[7,0,7,1],[7,7,7,8],[8,0,8,1],[8,7,8,8],[9,0,9,1],[9,7,9,8],[10,0,10,1],[10,7,10,8],[11,0,11,1],[11,7,11,8],[12,0,12,1],[12,7,12,8],[13,0,13,1],[13,7,13,8],[14,0,14,1],[14,7,14,8],[15,0,15,7],[16,0,16,2],[16,4,16,7],[18,0,18,7],[19,0,19,2],[19,3,19,7],[20,0,20,2],[20,3,20,7],[21,0,21,8],[22,5,22,6],[23,1,23,6],[24,1,24,3],[24,5,24,6]]}
["Betriebsbeschreibung gemäß Verordnung (EU) 2018/848 \nKontrollvorschriften gemäß VO (EU) 2018/848 Art. 39 sowie VO (EU) 2017/625 Art. 15\nHANDEL"]
[]
["Antworten - Es sind alle Fragen zu beantworten (ggf. mit \"nicht relevant\", \"nicht zutreffend\", o.ä)"]
["Name des Unternehmens (amtlich gemeldet, Hauptsitz)",null,{"$f":"IF('BB Teil I Verpflichtung'!$C$4=0,\"\",CONCATENATE('BB Teil I Verpflichtung'!$C$4,\" \",'BB Teil I Verpflichtung'!$C$5))","v":""}]
["Verantwortliche Person(en) für",null,"Vor- und Nachname","Telefon  ","Mobil","E-Mail","Qualifikation","Bemerkungen"]
["Qualitätsmanagement"]
["Buchhaltung"]
["Einkauf"]
["ggf. Prüfung Spezifikationen"]
["Warenannahme und Wareneingangskontrolle"]
{"$rows_left_out":16}
{"sheet":"Futtermittel","index":8,"n_rows":53,"n_cols":9,"rows_kept":53,"merged":[[0,0,0,8],[1,0,1,8],[2,0,2,8],[3,0,3,1],[3,2,3,8],[4,0,4,1],[4,7,4,8],[5,0,5,1],[5,7,5,8],[6,0,6,1],[6,7,6,8],[7,0,7,1],[7,7,7,8],[8,0,8,1],[8,7,8,8],[9,0,9,1],[9,7,9,8],[10,0,10,1],[10,7,10,8],[11,0,11,1],[11,7,11,8],[12,0,12,1],[12,7,12,8],[13,0,13,1],[13,7,13,8],[14,0,14,1],[14,7,14,8],[15,0,15,1],[15,7,15,8],[16,0,16,1],[16,7,16,8],[17,0,17,1],[17,7,17,8],[18,0,18,1],[18,7,18,8],[19,0,19,1],[19,7,19,8],[20,0,20,1],[20,7,20,8],[21,0,21,7],[22,0,22,2],[22,3,22,7],[23,0,23,2],[23,3,23,7],[24,0,24,2],[24,3,24,7],[25,0,25,2],[25,3,25,7],[26,0,26,8],[27,5,27,6],[29,1,29,3],[29,5,29,6],[30,1,30,3],[30,5,30,6],[31,1,31,8],[32,1,32,3],[32,5,32,6],[33,1,33,3],[33,5,33,6],[34,1,34,8],[35,1,35,3],[35,5,35,6],[36,1,36,3],[36,5,36,6],[37,1,37,3],[37,5,37,6],[44,5,44,7],[45,1,45,3],[45,5,45,7],[46,1,46,3],[46,5,46,7],[47,1,47,3],[47,5,47,7],[48,3,48,4],[49,3,49,4],[50,3,50,4],[51,3,51,4],[52,3,52,4]]}
["Betriebsbeschreibung gemäß Verordnung (EU) 2018/848 \nKontrollvorschriften gemäß VO (EU) 2018/848 Art. 39 sowie VO (EU) 2017/625 Art. 15\nFUTTERMITTEL"]
[null,null,{"$f":"IF('BB Teil I Verpflichtung'!C4=0,\"\",'BB Teil I Verpflichtung'!C4)","v":""}]
["Antworten - Es sind alle Fragen zu beantworten (ggf. mit \"nicht relevant\", \"nicht zutreffend\", o.ä)"]
["Name des Unternehmens (amtlich gemeldet, Hauptsitz)",null,{"$f":"IF('BB Teil I Verpflichtung'!$C$4=0,\"\",CONCATENATE('BB Teil I Verpflichtung'!$C$4,\" \",'BB Teil I Verpflichtung'!$C$5))","v":""}]
["Verantwortliche Person(en) für",null,"Vor- und Nachname","Telefon  ","Mobil","E-Mail","Qualifikation","Bemerkungen"]
["Umsetzung Öko-VO"]
["Qualitätsmanagement"]
["Buchhaltung"]
["Einkauf"]
["Prüfung Spezifikationen"]
{"$rows_left_out":44}
{"sheet":"Bestätigung der Angaben","index":9,"n_rows":13,"n_cols":4,"rows_kept":13,"merged":[[0,0,0,3],[1,0,1,3],[2,0,2,3]]}
["Betriebsbeschreibung gemäß Verordnung (EU) 2018/848 \nKontrollvorschriften gemäß VO (EU) 2018/848 Art. 39 \nsowie VO (EU) 2017/625 Art. 15"]
["Bestätigung der Vollständigkeit, Richtigkeit und Aktualität der in dieser Betriebsbeschreibung gemachten Angaben"]
[{"$f":"CONCATENATE(\"Für das Unternehmen \",'BB Teil I Verpflichtung'!C4,\" \",'BB Teil I Verpflichtung'!C5)","v":"Für das Unternehmen  "}]
["Jahr","Datum","Name Unterzeichner*in","Unterschrift"]
[2025]
[{"$f":"A5+1","v":2026}]
[{"$f":"A6+1","v":2027}]
[2028]
[2029]
[2030]
{"$rows_left_out":4}
{"sheet":"Dropdowns","index":10,"n_rows":21,"n_cols":16,"rows_kept":21}
["Allgemein","Allgemein mit n. rel.","Ja / Nein / N. rel.","Bioverbände","Gesellschaftsformen","Bundesländer","Vergabe an Dritte","Ergebnis WE-Kontrolle","Lageraufzeichnungen","Trennung bei Produktion","Maßnahmen zur Trennung","Angaben zu letzter Nicht-Rili-konformem Mitteleinsatz","Schlagaufzeichnungen","Vermarktungswege LW","Warenkontakt - Handel","Umgang mit öko- / nicht-öko Erzeugnissen"]
["Ja","Ja","Ja","Aranea/KRAV","Einzelunternehmen","Baden-Württemberg","Ja, Liste Subunternehmer als Anhang mit Nennung der Tätigkeit und des Codes der Kontrollstelle des Sub beifügen.","\"Bio ok\" + Datum + Unterschrift","Handschriftliche Aufzeichnungen","Es werden ausschließlich Öko-Erzeugnisse gelagert, verarbeitet und importiert","Sämtliche Arbeitsgänge und die verarbeiteten Mengen von ökologischen und nicht ökologischen Erzeugnissen werden dokumentiert","Es wird für alle Parzellen ein Zeitpunkt unmittelbar vor Eintritt in das Kontrollverfahren angenommen. Alle Wartezeiten sind abgelaufen, Altlasten sind nicht bekannt.","Schlagkartei","Verkauf an gewerbliche Abnehmer (Handel, Verarbeitung, Gastronomie)","Physischer Warenkontakt mit eigener Lagerhaltung. ","Nur öko-Erzeugnisse"]
["Nein","Nicht relevant","Nein","Bayerische Bio-Siegel (LQB GmbH)","GbR","Bayern","Nein","\"Bio V\" + Datum + Unterschrift","Aufzeichnungen per EDV-Liste","Öko-Erzeugnisse werden über andere Anlagen aufbereitet/verarbeitet als nicht ökologische Erzeugnisse","Benennen der geschlossenen Durchführung der Tätigkeit (z. B. fester Wochentag/e, feststehende Zeiten)","Die Angaben sind im Flächenverzeichnis oder der Anbauplanung enthalten.","Register","Online-Shop","Kein physischer Kontakt mit der Ware - Logistik an Subunternehmen ausgelagert.","Öko- und nicht-öko-Erzeugnisse"]
["Auswählen","Auswählen","Nicht relevant","Biokreis e.V. ","OHG","Berlin",null,"Stempel (Muster in Anlage)","EDV-gestütztes Warenwirtschaftssystem","Öko-Erzeugnisse kommen zu keinem Zeitpunkt und an keinem Ort mit Erzeugnissen, die nicht der EG-Öko-BasisVO entsprechen, in Berührung",null,"Beigefügte Schlagkarteien geben Auskunft über Art und Datum der lkM:","tabellarisch","Direktvermarktung ","Kein physischer Kontakt mit der Ware - reines Streckengeschäft","Keine Öko-Erzeugnisse"]
[{"$nulls":3},"Bioland e.V. ","GmbH","Brandenburg",null,"Wareineingangsdokument (Muster in Anlage)","Anderes Verfahren","Öko-Erzeugnisse und nicht ökologische Erzeugnisse werden in/über dieselben Maschinen und Anlagen und Lagereinrichtungen gefördert, aufbereitet bzw. gelagert",null,"Beigefügte Nachweise (z.B. über amtliche Agrarumweltmaßnahme) bestätigen, dass auf den Parzellen seit mindestens drei Jahren keine unzulässigen Mittel eingesetzt wurden.","elektronisch"]
[{"$nulls":3},"Biopark e.V.","GmbH & Co. KG","Bremen",null,"Digitale Erfassung der WE-Parameter (Screenshots / Nachweise in Anlage)",{"$nulls":3},"Angaben in gesonderter Anlage","andere"]
[{"$nulls":3},"Biosiegel Hessen","AG","Hamburg"]
[{"$nulls":3},"BioSuisse ",null,"Hessen"]
[{"$nulls":3},"Biozeichen Baden-Württemberg",null,"Mecklenburg-Vorpommern"]
[{"$nulls":3},"Demeter",null,"Niedersachsen"]
{"$rows_left_out":11}