{"text_format":"1","workbook":"xlsx","n_sheets":15,"sheets":["Anleitung","OSP-Tier-Maßnahmen","Rinder","Kl. Wiederkäuer_Equidien","Schweine","Kaninchen","Geweihträger","Legehennen","Junghennen-Bruderhähne","Masthähnchen","Mastputen","Mastgeflügel","Randlängen-Rund","Berechnungstabellen","Dropdown"],"not_rendered":{"charts":0,"images":35,"macros":1,"external_links":0,"defined_names":16,"comments":5,"pivot_tables":0},"unopened":[],"bounds":{"document_bytes":16777216,"sheet_cells":100000,"rows_first":2000,"rows_last":500,"rows_between":2000,"halvings":0,"cell_chars":16384,"cell_head_chars":4096},"cells_cut":0,"cells_raw":0,"read":"whole","date_system":"1900"}

{"sheet":"Anleitung","index":0,"n_rows":304,"n_cols":4,"rows_kept":304,"cut":false,"hidden":false,"merged":[[156,3,161,6],[162,0,162,6],[170,0,170,6],[180,0,180,6],[76,0,76,6],[85,0,85,6],[140,0,140,6],[141,0,141,6],[150,0,150,6],[77,0,77,6],[86,0,86,6],[58,0,58,6],[2,0,2,6],[67,0,67,6],[99,0,99,6],[181,0,181,6],[100,0,100,6],[121,0,121,6],[139,0,139,6],[68,0,68,6],[69,0,69,6],[70,0,70,6],[71,0,71,6],[72,0,72,6],[59,0,59,6],[60,0,60,6],[61,0,61,6],[282,0,282,6],[292,0,292,6],[303,0,303,6],[264,0,264,6],[265,0,265,6],[277,0,277,6],[273,2,275,5],[263,0,263,6],[107,3,111,6],[197,3,202,6],[239,3,241,6],[223,0,223,6],[235,0,235,6],[242,0,242,6],[243,0,243,6],[253,0,253,6],[182,0,182,6],[203,0,203,6],[211,0,211,6],[221,0,221,6],[191,0,191,6],[222,0,222,6],[112,0,112,6],[62,0,62,6],[63,0,63,6],[54,0,54,6],[28,0,28,6],[0,0,0,6],[32,0,32,6],[39,0,39,6],[52,0,52,6],[53,0,53,6],[1,0,1,6],[16,0,16,6],[23,0,23,6],[24,0,24,6],[25,0,25,6],[29,0,29,6],[31,0,31,6]]}
["Sehr geehrte Landwirtin, sehr geehrter Landwirt,"]
["den zunehmenden Anforderungen an die Biokontrolle- und Zertifizierung  werden die bisher verwendeten Word-Dokumente nicht mehr gerecht .\nDaher haben wir dieses Dokument entwickelt, um sicher zu stellen, dass Ihr Betrieb und wir den aktuellen Qualitätsansprüchen einer Biokontrolle entsprechen.\n\nBitte lesen Sie sich diese Anleitung sorgfältig durch, um die Berechnungstabellen für die Tierarten, die auf Ihrem Betrieb gehalten werden, auch richtig ausfüllen zu können.\nIm Grunde sind die Tabellen selbsterklärend und daher auch einfach auszufüllen. \n\nGutes Gelingen beim Ausfüllen der Tabellen und bei Fragen steht Ihnen Ihr Ansprechpartner in Ihrem Regioteam gerne zur Verfügung.\n"]
["Inhaltsverzeichnis"]
["Kapitel",null,"Beschreibung","Anzahl Druckseiten"]
["1. Maßnahmen",null,"link","3"]
["2. Rinder",null,"link","max. 4"]
["3. Pferde u. kl. Widerkäuer",null,"link","max. 2"]
["4. Schweine",null,"link","max. 3"]
["5. Kaninchen",null,"link","max. 3"]
["6. Geweihträger",null,"link","max. 3"]
["7. Legehennen",null,"link","2"]
["8. Junghennen-Bruderhähne",null,"link","2"]
["9. Masthähnchen",null,"link","2"]
["10. Mastputen",null,"link","2"]
["11. sonst. Mastgeflügel",null,"link","2"]
[]
["1.  <OSP-Tier-Maßnahmen>  \nFangen Sie mit dem Ausfüllen dieser Registerkarte an.\nNachdem Sie die abgefragten Basisdaten in die dafür vorgesehenen Felder eingetragen haben, wählen Sie bitte die von Ihnen gehaltene Tierart aus. Daraufhin öffnet sich das entsprechende Stalldatenblatt in einem eigenen Register. \nAnschließend tragen Sie bitte in die Tabelle 1) die von Ihnen eingesetzten Futtermittel ein. Falls die Tabelle nicht ausreicht, können Sie auch auf einen Anhang verweisen, in dem die Futtermittel vollständig aufgeführt sind.\n2) Zucht: hier können Sie in dem Dropdown-Menü die auf Ihrem Betrieb hauptsächlich eingesetzte Zuchtmethode auswählen:"]
[]
[]
[]
[]
[]
[]
["Im darunter liegenden Kommentarfeld tragen Sie bitte noch nähere Erläuterungen ein, sofern notwendig. Z.B. wenn Sie bei Ihrer Mutterkuhherde Natursprung als Zuchtmethode einsetzen, bei den Zuchtschweinen aber künstliche Besamung, dann trage Sie eine solche Differenzierung bitte im Kommentarfeld ein."]
["3) und 4): bitte tragen Sie hier die jeweiligen angefragten Angaben ein."]
["5) Damit der Stickstoffanfall je ha Dungfläche richtig berechnet werden kann tragen Sie im Feld ha"]
[]
[]
["bitte die ha-Zahl der von Ihnen laut amtlichem FNN bewirtschafteten DUNGfläche ein. Die Größe der von Ihnen bewirtschfteten Flächen, auf denen kein Wirtschaftsdünger ausgebracht werden darf, muss von der auf dem FNN angegebenen Gesamtfläche abgezogen werden. Und dieser Betrag wird in dem oben gezeigten Feld eingetragen."]
["Die weiteren Eingabefelder beantworten Sie bitte gemäß der Fragestellung bzw. der jeweiligen Spaltenüberschrift"]
[]
["2. Stalldatenblatt Rinder"]
["In der Registerkarte <Rinder> finden Sie die Eingabetabelle für vier verschiedene Ställe. Falls Sie mehr Rinderställe bewirtschaften, melden Sie sich bitte bei uns, wir fügen dann weitere Ställe hinzu.\nBitte verwenden Sie für jeden von Ihnen genutzten Stall eine eigene Tabellenvorlage.\nBitte wählen Sie zunächst aus, ob es sich bei dem genutzten Stall bezüglich der Haltung von Milchkühen um einen Laufstall oder Anbindestall handelt.:"]
[]
[]
[]
[]
[]
[]
["Bitte stellen Sie in der Spalte <Box-nummer(n) lt. Stall-plan> einen Bezug zum Stallplan her, so dass nachvollzogen werden kann, in welcher Box die Tiere welcher Tiergruppe stehen.\nFalls Tiere einer Tiergruppe in mehreren Boxen in einem Stall aufgestallt sind, dann können in der Spalte auch all diese Boxen aufgeführt werden.\nBleibt dieses Feld leer, bleibt die max. erlaubte Tierzahl immer 0. Dieses Feld muss also unbedingt ausgefüllt werden!"]
[]
[]
[]
[]
[]
[]
[]
[]
[]
[]
[]
[]
["Alle weiteren gelb hinterlegten Felder füllen Sie bitte entsprechend der Anfrage in der Spaltenüberschrift für die jeweilige Tiergruppe aus. Wenn in der Spalte <Boxennummer(n) …> mehrere Boxen aufgeführt sind, tragen Sie in die Spalten die jeweilige Summe ein."]
["In der Zeile <Geprüfte Maßangaben> müssen Sie nichts eintragen. Das Feld ist vom Inspektor auszufüllen."]
["Falls auf Ihrem Betrieb für die Tierhaltung Ausnahmegenehmigungen bestehen, dann tragen Sie diese bitte in das Feld <Anmerkungen / best. ANG´s> ein:"]
[]
[]
[]
["3. Kleine Widerkäuer / Pferde"]
["In der Registerkarte <Equiden_kl Widerkäuer> finden Sie die Eingabetabelle für vier verschiedene Ställe. Falls Sie mehr Ställe für Tiere in dieser Kategorie bewirtschaften, melden Sie sich bitte bei uns, wir fügen dann weitere Ställe hinzu.\nBitte verwenden Sie für jeden von Ihnen genutzten Stall eine eigene Tabellenvorlage.\n"]
["Bitte stellen Sie in der Spalte <Box-nummer(n) lt. Stall-plan> einen Bezug zum Stallplan her, so dass nachvollzogen werden kann, in welcher Box die Tiere welcher Tiergruppe stehen.\nFalls Tiere einer Tiergruppe in mehreren Boxen in einem Stall aufgestallt sind, dann können in der Spalte auch all diese Boxen aufgeführt werden.\nBleibt dieses Feld leer, bleibt die max. erlaubte Tierzahl immer 0. Dieses Feld muss also unbedingt ausgefüllt werden!"]
["Alle weiteren gelb hinterlegten Felder füllen Sie bitte entsprechend der Anfrage in der Spaltenüberschrift für die jeweilige Tiergruppe aus. Wenn in der Spalte <Boxennummer(n) …> mehrere Boxen aufgeführt sind, tragen Sie in die Spalten die jeweilige Summe ein."]
["In der Zeile <Geprüfte Maßangaben> müssen Sie nichts eintragen. Das Feld ist vom Inspektor auszufüllen."]
["Falls auf Ihrem Betrieb für die Tierhaltung Ausnahmegenehmigungen bestehen, dann tragen Sie diese bitte in das Feld <Anmerkungen / best. ANG´s> ein:"]
[]
[]
[]
["4. Schweine"]
["In der Registerkarte <Schweine> finden Sie die Eingabetabelle für fünf verschiedene Ställe. Falls Sie mehr Ställe für Tiere in dieser Kategorie bewirtschaften, melden Sie sich bitte bei uns, wir fügen dann weitere Ställe hinzu.\nBitte verwenden Sie für jeden von Ihnen genutzten Stall eine eigene Tabellenvorlage.\n"]
["Bitte stellen Sie in der Spalte <Box-nummer(n) lt. Stall-plan> einen Bezug zum Stallplan her, so dass nachvollzogen werden kann, in welcher Box die Tiere welcher Tiergruppe stehen.\nFalls Tiere einer Tiergruppe in mehreren Boxen in einem Stall aufgestallt sind, dann können in der Spalte auch all diese Boxen aufgeführt werden.\nBleibt dieses Feld leer, bleibt die max. erlaubte Tierzahl immer 0. Dieses Feld muss also unbedingt ausgefüllt werden!"]
["Alle weiteren gelb hinterlegten Felder füllen Sie bitte entsprechend der Anfrage in der Spaltenüberschrift für die jeweilige Tiergruppe aus. Wenn in der Spalte <Boxennummer(n) …> mehrere Boxen aufgeführt sind, tragen Sie in die Spalten die jeweilige Summe ein."]
["In der Zeile <Geprüfte Maßangaben> müssen Sie nichts eintragen, das Feld ist vom Inspektor auszufüllen."]
["Falls auf Ihrem Betrieb für die Tierhaltung Ausnahmegenehmigungen bestehen, dann tragen Sie diese bitte in das Feld <Anmerkungen / best. ANG´s> ein:"]
[]
[]
[]
["6. Kaninchen"]
["Bitte je Stall ein Blatt ausfüllen. Damit beginnen, auszuwählen, ob es sich um einen festen oder mobilen Stall handelt. Dann alle weiteren gelb hinterlegten Felder entsprechend der gehaltenen Tiergruppen ausfüllen."]
[]
[]
[]
[]
[]
[]
[]
["7. Geweihträger"]
["Bitte je Gehege ein Blatt ausfüllen. Alle weiteren gelb hinterlegten Felder entsprechend der gehaltenen Tiergruppen ausfüllen."]
[]
[]
[]
[]
[]
[]
[]
[]
[]
[]
[]
[]
["8. Legehennen"]
["Je Stall, der von Ihnen für die Haltung von Legehennen genutzt wird, existiert in dem Register <LH> eine Zeile:"]
[]
[]
[]
[]
[]
[]
[null,null,null,"Alle gelb hinterlegten Zellen in einer Zeile müssen ausgefüllt werden, damit die Tabelle ein Ergebnis errechnen kann."]
[]
[]
[]
[]
["Falls Sie in Ihren Ställen runde Futter- oder Tränkeeinrichtungen einsetzen, dann können Sie die Randlängen der runden Futtereinrichtunge, die hier eingetragen werden müssen"]
[]
[]
[]
[]
[]
[]
[]
[]
["über die Registerkarte <Randlängen-Rund> einfach ermitteln, in dem Sie dort bei dem jeweiligen Stall die Anzahl der genutzten Einrichtungen sowie deren jeweiligen Durchmesser eingeben:"]
[]
[]
[]
[]
[]
[]
[]
[]
[]
[]
[]
[]
[]
[]
[]
[]
[]
["Die Tabelle errechnet dann automatisch die Gesamt-Randlänge aller von Ihnen genutzten runden Futter- bzw. Tränkeeinrichtungen und überträgt die Zahl in die Haupttabelle <LH>."]
["9. Junghennen-Bruderhähne"]
["Je Stall, der von Ihnen für die Haltung von Junghennen / Bruderhähnen genutzt wird, existiert in dem Register <Junghenne-Bruderhähne> eine Zeile:"]
[]
[]
[]
[]
[]
[]
[]
[]
["Bitte beachten Sie bei der Dateneingabe, dass unterschieden wird zwischen Festen Ställen und beweglichen Ställen, da hierfür ggf. andere gesetzliche Vorgaben existieren:"]
[]
[]
[]
[]
[]
[null,null,null,"Alle gelb hinterlegten Zellen in einer Zeile müssen ausgefüllt werden, damit die Tabelle ein Ergebnis errechnen kann."]
[]
[]
[]
[]
[]
["Falls Sie in Ihren Ställen runde Futter- oder Tränkeeinrichtungen einsetzen, dann können Sie die Randlängen der runden Futtereinrichtunge, die hier eingetragen werden müssen"]
[]
[]
[]
[]
[]
[]
[]
["über die Registerkarte <Randlängen-Rund> einfach ermitteln, in dem Sie dort bei dem jeweiligen Stall die Anzahl der genutzten Einrichtungen sowie deren jeweiligen Durchmesser eingeben:"]
[]
[]
[]
[]
[]
[]
[]
[]
[]
["Die Tabelle errechnet dann automatisch die Gesamt-Randlänge aller von Ihnen genutzten runden Futter- bzw. Tränkeeinrichtungen und überträgt die Zahl in die Haupttabelle <Junghenne-Bruderhähne>."]
["7. Masthähnchen"]
["Je Stall, der von Ihnen für die Haltung von Masthähnchen bzw. Kapaunen und Poularden genutzt wird, existiert in dem Register <Masthähnchen> eine Zeile. Beginnend mit der Liste der Ställe für Masthähnchen gefolgt von den Tabellen für Kapaune und Poularden."]
[]
[]
[]
[]
[]
[]
[]
[]
["Bitte beachten Sie bei der Dateneingabe, dass unterschieden wird zwischen Festen Ställen und beweglichen Ställen, da hierfür jeweils andere gesetzliche Vorgaben existieren:"]
[]
[]
[]
[]
[]
[null,null,null,"Alle gelb hinterlegten Zellen in einer Zeile müssen ausgefüllt werden, damit die Tabelle ein Ergebnis errechnen kann."]
[]
[]
[]
[]
[]
["Falls Sie in Ihren Ställen runde Futter- oder Tränkeeinrichtungen einsetzen, dann können Sie die Randlängen der runden Futtereinrichtungen, die hier eingetragen werden müssen"]
[]
[]
[]
[]
[]
[]
[]
["über die Registerkarte <Randlängen-Rund> einfach ermitteln, in dem Sie dort bei dem jeweiligen Stall die Anzahl der genutzten Einrichtungen sowie deren jeweiligen Durchmesser eingeben:"]
[]
[]
[]
[]
[]
[]
[]
[]
[]
["Die Tabelle errechnet dann automatisch die Gesamt-Randlänge aller von Ihnen genutzten runden Futter- bzw. Tränkeeinrichtungen und überträgt die Zahl in die Haupttabelle <Mast-H>."]
["8. Mast-Puten"]
["Je Stall, der von Ihnen für die Haltung von Mastputen genutzt wird, existiert in dem Register <M-Puten> eine Zeile:"]
[]
[]
[]
[]
[]
[]
[]
[]
[]
[]
[]
["Bitte beachten Sie bei der Dateneingabe, dass unterschieden wird zwischen Festen Ställen und beweglichen Ställen, da hierfür jeweils andere gesetzliche Vorgaben existieren:"]
[]
[]
[]
[null,null,null,"Alle gelb hinterlegten Zellen in einer Zeile müssen ausgefüllt werden, damit die Tabelle ein Ergebnis errechnen kann."]
[]
[]
[]
["Falls Sie in Ihren Ställen runde Futter- oder Tränkeeinrichtungen einsetzen, dann können Sie die Randlängen der runden Futtereinrichtunge, die hier eingetragen werden müssen"]
[]
[]
[]
[]
[]
[]
[]
[]
[]
["über die Registerkarte <Randlängen-Rund> einfach ermitteln, in dem Sie dort bei dem jeweiligen Stall die Anzahl der genutzten Einrichtungen sowie deren jeweiligen Durchmesser eingeben:"]
[]
[]
[]
[]
[]
[]
[]
[]
[]
["Die Tabelle errechnet dann automatisch die Gesamt-Randlänge aller von Ihnen genutzten runden Futter- bzw. Tränkeeinrichtungen und überträgt die Zahl in die Haupttabelle <M-Puten>."]
["9. sonstiges Mastgeflügel: Enten, Gänse, Perlhühner"]
["Je Stall, der von Ihnen für die Haltung von Enten, Gänsen oder Perlhühnern genutzt wird, existiert in dem Register <M-Gefl-sonst> eine Zeile und jeweils 4 Zeilen je Tierart:"]
[]
[]
[]
[]
[]
[]
[]
[null,null,"Alle gelb hinterlegten Zellen in einer Zeile müssen ausgefüllt werden, damit die Tabelle ein Ergebnis errechnen kann."]
[]
[]
[]
[]
[]
[]
[]
[]
["Falls Sie in Ihren Ställen runde Futter- oder Tränkeeinrichtungen einsetzen, dann können Sie die Randlängen der runden Futtereinrichtunge, die hier eingetragen werden müssen"]
[]
[]
[]
[]
[]
[]
[]
[]
[]
["über die Registerkarte <Randlängen-Rund> einfach ermitteln, in dem Sie dort bei dem jeweiligen Stall die Anzahl der genutzten Einrichtungen sowie deren jeweiligen Durchmesser eingeben:"]
[]
[]
[]
[]
[]
[]
[]
[]
[]
[]
["Die Tabelle errechnet dann automatisch die Gesamt-Randlänge aller von Ihnen genutzten runden Futter- bzw. Tränkeeinrichtungen und überträgt die Zahl in die Haupttabelle <M-Gefl-sonst>."]

{"sheet":"OSP-Tier-Maßnahmen","index":1,"n_rows":98,"n_cols":9,"rows_kept":98,"cut":false,"hidden":false,"merged":[[31,0,38,7],[0,2,0,5],[1,2,1,5],[22,2,22,4],[2,7,3,8],[23,2,23,4],[24,2,24,4],[25,2,25,4],[26,1,28,7],[91,1,91,4],[67,0,67,1],[68,0,68,1],[71,0,71,1],[72,0,72,1],[73,0,73,1],[88,2,88,4],[76,0,76,5],[77,0,80,7],[85,0,85,7],[69,0,69,1],[70,0,70,1],[53,2,53,7],[55,2,55,7],[61,1,61,7],[41,0,48,7],[62,0,63,7],[57,0,57,7]]}
[null,"Betrieb (Name, ggf. Vorname)"]
[null,"Öko-Kontrollnummer"]
["Tierart(en)",null,null,null,null,null,null,"Bitte das jeweilige Stalldatenblatt vollständig ausfüllen!"]
[]
[]
["A) Bewirtschaftungsplan"]
["1) Fütterung"]
["Tierart","hofeigene Futtermittel","Status","Menge","Einheit","Zukaufsfuttermittel","Status","Menge","Einheit"]
[]
[]
[]
[]
[]
[]
[]
[]
[]
[]
[]
[]
[]
["2) Zucht","Tierart","Zuchtart"]
[]
[]
[]
[]
["Kommentar:"]
[]
[]
[]
["3) Tiergesundheit (Maßnahmen zur Krankheitsvorsorge, Identifizierung von Problembereichen, u. ä.):"]
[]
[]
[]
[]
[]
[]
[]
[]
[]
["4) Tierhaltung (Stallbauvorhaben, Auslauf, Freiflächen, sonstige Maßnahmen):"]
[]
[]
[]
[]
[]
[]
[]
[]
[]
["5) Haltung von Pensionstieren"]
["Tierart",null,null,"Anzahl von Tieren"]
[]
["Beweidete Flächen"]
[]
["Genutzte Stalleinrichtungen"]
[]
["6) Stickstoffanfall je Hektar ökologischer landwirtschaftlicher Nutzfläche aus eigenen Wirtschaftsdüngern über alle Tierarten (entspricht 170 kg N pro ha und Jahr gem. VO (EU) 2018/848 Anh II Teil II 1.6.6):"]
[null,null,"Bewirtschaftete Dungfläche lt. amtlichem FNN:",null,"ha","Gesamt GV lt. FNN"]
[null,null,"Gesamt N über alle Tierarten:",{"$f":"G59*170","v":0},"kg"]
[null,null,"kg N je ha",{"$f":"IF(D59=0,0,D60/D59)","v":0},"kg N je ha Dungfläche"]
["Fazit:",{"$f":"IF(D59=0,\"\",IF(D61<=170,CONCATENATE(\"Zulässige Höchstmenge von 170 kg N je ha Dungfläche eingehalten.\"),CONCATENATE(\"ACHTUNG!! Zulässige Höchstmenge von \",Berechnungstabellen!L2,\" kg N je ha Dungfläche überschritten! - Bitte im Folgenden Maßnahmen beschreiben, die dazu führen, den zulässigen Höchstwert von \",Berechnungstabellen!L2,\" kg N je ha Dungfläche einzuhalten.\")))","v":""}]
[]
[]
[]
["B) Ausbringplan"]
["Auf meinem Betrieb fallen im Jahr folgende Mengen an Wirtschaftsdünger an:"]
["Düngerart",null,"Menge ","Einheit","Stickstoff (kg N) \nje Einheit","Stickstoff ges."]
[null,null,null,null,null,{"$f":"C69*E69","v":0}]
[null,null,null,null,null,{"$f":"C70*E70","v":0}]
[null,null,null,null,null,0]
[null,null,null,null,null,{"$f":"C72*E72","v":0}]
[null,null,null,null,null,{"$f":"C73*E73","v":0}]
[null,null,null,null,null,{"$f":"C74*E74","v":0}]
[null,null,null,null,"Stickstoff Wirtschaftsdünger ges.:",{"$f":"SUM(F69:F74)","v":0}]
[]
["Die Düngermenge wird wie folgt auf eigene biologisch bewirtschaftete Fläche verteilt:\n(Bsp.: Festmist x dt pro ha vor Weizen im Monat y / Gülle x m³ pro ha nach jedem Schnitt)"]
[]
[]
[]
[]
[]
["Soweit zutreffend bitte ankreuzen:"]
["Die schriftlichen Vereinbarungen mit anderen Landwirten über die Dungabgabe sind in der Anlage beigefügt."]
[]
["Dieser Plan ist Bestandteil der Betriebsbeschreibung (Maßnahmen). Eine Zweitschrift verbleibt auf dem Betrieb und wird bei der jährlichen Kontrolle bereitgehalten. Änderungen werden eingetragen und der Kontrollstelle mitgeteilt."]
[]
[]
["_______________________________",null,"________________________________"]
["Ort, Datum",null,"Unterschrift"]
[]
["genehmigt:","________________________________"]
[null,"Datum, Unterschrift der Kontrollstelle"]
[]
[]
[]
[]
[" "]

{"sheet":"Rinder","index":2,"n_rows":80,"n_cols":23,"rows_kept":80,"cut":false,"hidden":false,"merged":[[79,3,79,18],[1,11,1,13],[41,11,41,13],[61,11,61,13],[57,3,57,18],[77,3,77,18],[37,3,37,18],[17,3,17,18],[21,11,21,13],[19,3,19,18],[39,3,39,18],[59,3,59,18],[6,0,6,1],[7,0,7,1],[8,0,8,1],[73,0,73,1],[74,0,74,1],[54,0,54,1],[56,0,56,1],[47,0,47,1],[48,0,48,1],[50,0,50,1],[51,0,51,1],[53,0,53,1],[13,0,13,1],[14,0,14,1],[10,0,10,1],[11,0,11,1],[76,0,76,1],[66,0,66,1],[67,0,67,1],[68,0,68,1],[70,0,70,1],[71,0,71,1],[2,20,3,22],[4,20,4,22],[25,0,25,1],[45,0,45,1],[65,0,65,1],[46,0,46,1],[31,0,31,1],[33,0,33,1],[34,0,34,1],[36,0,36,1],[26,0,26,1],[27,0,27,1],[28,0,28,1],[30,0,30,1],[5,0,5,1],[16,0,16,1]]}
["Ermittlung der maximalen Tierzahl, die gem. EU VO 2018/848 sowie 2020-464 Anhang I je Stallblatt gehalten werden darf",null,null,null,null,null,null,null,null,null,null,null,null,null,null,null,null,null,"Rinder"]
["Stallblatt",1,"Stallname (bei mehreren Ställen bzw. bei Anbinde- UND Laufstallhaltung f. Rinder > 2 Jahre in einem Stall: Je Stall bzw. Haltungsform ist das Formular jew. separat auszufüllen):",null,null,null,null,null,null,null,null,null,null,null,null,"Baujahr:"]
["Laufstall",null,"Stallgebäude",null,null,null,null,null,null,null,null,"Außenfläche (muss planbefestigt sein!)",null,null,null,null,null,null,null,null,"Zum Abgleich Eingabe Ecert mit HITier Tagesbestand"]
["Anbindehaltung",null,null,null,"Stallfläche",null,null,null,"Stallboden",null,null,null,null,"Außenfläche",null,null,"Überdachung"]
[null,null,"Min. \nm²/Tier","Box-nummer(n) lt. Stall-plan","Stall-fläche\nm² ","max. Tierzahl \nStallfläche","Anzahl Liege-plätze","davon Spaltenboden / perforiert m²","in %","max. Tierzahl \nStallboden","Belegung\naktuell","Min. \nm²/Tier","Zugang Sommer-weide möglich (Mai-Okt.)","\nAußen-fläche\nm² ","max. Tierzahl \nAußen-flächen","Über-dachung m2","Über-dachung %","max. Tierzahl \nÜber-dachung","Max. Tier-zahl",null,"Tierzahl ges. über alle Ställe"]
["Tiergruppe",null,null,null,null,null,null,"max. ",0.5,null,null,null,null,null,null,"max.",0.5,null,null,null,null,"Max Tierzahl ges.","Gehaltene Tiere"]
["Kälber <1 Jahr <100kg",null,1.5,null,null,{"$f":"ROUNDDOWN(E7/C7,0)","v":0},null,null,{"$f":"IF(ISERROR(H7/E7),0,H7/E7)","v":0},{"$f":"IF(H7=0,F7,IF(ROUNDDOWN(E7/C7/(H7/(E7/2)),0)<(E7/C7),ROUNDDOWN(E7/C7/(H7/(E7/2)),0),ROUNDDOWN(E7/C7,0)))","v":0},null,1.1000000000000001,null,null,{"$f":"IF(M7=\"JA\",MIN(F7,J7),ROUNDDOWN(N7/L7,0))","v":0},null,{"$f":"IF(N7=0,0,P7/N7)","v":0},{"$f":"IF(M7=\"JA\",O7,IF(N7=0,0,IF(ROUNDDOWN((O7+(O7*-((P7-(N7*Q$6))/(N7-(N7*Q$6))))),0)>O7,O7,(ROUNDDOWN((O7+(O7*-((P7-(N7*Q$6))/(N7-(N7*Q$6))))),0)))))","v":0},{"$f":"Berechnungstabellen!I4","v":0},null,{"$f":"A7","v":"Kälber <1 Jahr <100kg"},{"$f":"Berechnungstabellen!J4","v":0},{"$f":"K7+K27+K47+K67","v":0}]
["Kälber <1 Jahr <200kg",null,2.5,null,null,{"$f":"ROUNDDOWN(E8/C8,0)","v":0},null,null,{"$f":"IF(ISERROR(H8/E8),0,H8/E8)","v":0},{"$f":"IF(H8=0,F8,IF(ROUNDDOWN(E8/C8/(H8/(E8/2)),0)<(E8/C8),ROUNDDOWN(E8/C8/(H8/(E8/2)),0),ROUNDDOWN(E8/C8,0)))","v":0},null,1.9,null,null,{"$f":"IF(M8=\"JA\",MIN(F8,J8),ROUNDDOWN(N8/L8,0))","v":0},null,{"$f":"IF(N8=0,0,P8/N8)","v":0},{"$f":"IF(M8=\"JA\",O8,IF(N8=0,0,IF(ROUNDDOWN((O8+(O8*-((P8-(N8*Q$6))/(N8-(N8*Q$6))))),0)>O8,O8,(ROUNDDOWN((O8+(O8*-((P8-(N8*Q$6))/(N8-(N8*Q$6))))),0)))))","v":0},{"$f":"Berechnungstabellen!I5","v":0},null,{"$f":"A8","v":"Kälber <1 Jahr <200kg"},{"$f":"Berechnungstabellen!J5","v":0},{"$f":"K8+K28+K48+K68","v":0}]
["Rinder 1-2 Jahr <350kg",null,4,null,null,{"$f":"ROUNDDOWN(E9/C9,0)","v":0},null,null,{"$f":"IF(ISERROR(H9/E9),0,H9/E9)","v":0},0,null,3,null,null,0,null,{"$f":"IF(N9=0,0,P9/N9)","v":0},0,{"$f":"Berechnungstabellen!I6","v":0},null,{"$f":"A9","v":"Rinder 1-2 Jahr <350kg"},{"$f":"Berechnungstabellen!J6","v":0},0]
[]
["Milchkühe",null,6,null,null,{"$f":"IF(B4=\"JA\",G11,ROUNDDOWN(E11/C11,0))","v":0},null,null,{"$f":"IF(ISERROR(H11/E11),0,H11/E11)","v":0},0,null,4.5,null,null,{"$f":"IF($B$4=\"JA\",IF(M11=\"JA\",G11,ROUNDDOWN(N11/L11,0)),IF(M11=\"JA\",ROUNDDOWN(MIN(F11,J11),0),N11/L11))","v":0},null,{"$f":"IF(N11=0,0,P11/N11)","v":0},{"$f":"IF(M11=\"JA\",O11,IF(N11=0,0,IF(ROUNDDOWN((O11+(O11*-((P11-(N11*Q$6))/(N11-(N11*Q$6))))),0)>O11,O11,(ROUNDDOWN((O11+(O11*-((P11-(N11*Q$6))/(N11-(N11*Q$6))))),0)))))","v":0},{"$f":"Berechnungstabellen!I7","v":0},null,{"$f":"A11","v":"Milchkühe"},{"$f":"Berechnungstabellen!J7","v":0},0]
["Mutter-/ Ammenkühe",null,6,null,null,{"$f":"IF(B4=\"JA\",G12,ROUNDDOWN(E12/C12,0))","v":0},null,null,{"$f":"IF(ISERROR(H12/E12),0,H12/E12)","v":0},0,null,4.5,null,null,{"$f":"IF($B$4=\"JA\",IF(M12=\"JA\",G12,ROUNDDOWN(N12/L12,0)),IF(M12=\"JA\",ROUNDDOWN(MIN(F12,J12),0),N12/L12))","v":0},null,{"$f":"IF(N12=0,0,P12/N12)","v":0},{"$f":"IF(M12=\"JA\",O12,IF(N12=0,0,IF(ROUNDDOWN((O12+(O12*-((P12-(N12*Q$6))/(N12-(N12*Q$6))))),0)>O12,O12,(ROUNDDOWN((O12+(O12*-((P12-(N12*Q$6))/(N12-(N12*Q$6))))),0)))))","v":0},{"$f":"Berechnungstabellen!I8","v":0},null,{"$f":"A12","v":"Mutter-/ Ammenkühe"},{"$f":"Berechnungstabellen!J8","v":0},0]
[null,null,"1m²/100kg",null,null,null,null,null,null,null,null,"0,75m²/100kg"]
["Bullen >2 Jahr >350kg",null,5,null,null,{"$f":"ROUNDDOWN(E14/C14,0)","v":0},null,null,{"$f":"IF(ISERROR(H14/E14),0,H14/E14)","v":0},0,null,3.7,null,null,{"$f":"IF($B$4=\"JA\",IF(M14=\"JA\",G14,ROUNDDOWN(N14/L14,0)),IF(M14=\"JA\",ROUNDDOWN(MIN(F14,J14),0),N14/L14))","v":0},null,{"$f":"IF(N14=0,0,P14/N14)","v":0},0,{"$f":"Berechnungstabellen!I9","v":0},null,{"$f":"A14","v":"Bullen >2 Jahr >350kg"},{"$f":"Berechnungstabellen!J9","v":0},0]
["Färsen >2 Jahr >350kg",null,5,null,null,{"$f":"ROUNDDOWN(E15/C15,0)","v":0},null,null,{"$f":"IF(ISERROR(H15/E15),0,H15/E15)","v":0},0,null,3.7,null,null,{"$f":"IF($B$4=\"JA\",IF(M15=\"JA\",G15,ROUNDDOWN(N15/L15,0)),IF(M15=\"JA\",ROUNDDOWN(MIN(F15,J15),0),N15/L15))","v":0},null,{"$f":"IF(N15=0,0,P15/N15)","v":0},0,{"$f":"Berechnungstabellen!I10","v":0},null,{"$f":"A15","v":"Färsen >2 Jahr >350kg"},{"$f":"Berechnungstabellen!J10","v":0},0]
["bei Einzelhaltung; wenn Haltung in Herde mit weibl. Rindern, wird Zuchtbulle wie Rind der jew. Gruppe gezählt"]
["Zuchtbullen",null,10,null,null,{"$f":"ROUNDDOWN(E17/C17,0)","v":0},null,null,{"$f":"IF(ISERROR(H17/#REF!),0,H17/#REF!)","v":0},{"$f":"IF(H17=0,F17,IF(ROUNDDOWN(#REF!/C17/(H17/(#REF!/2)),0)<(#REF!/C17),ROUNDDOWN(#REF!/C17/(H17/(#REF!/2)),0),ROUNDDOWN(#REF!/C17,0)))","v":0},null,30,null,null,{"$f":"IF($B$4=\"JA\",IF(M17=\"JA\",G17,ROUNDDOWN(N17/L17,0)),IF(M17=\"JA\",ROUNDDOWN(MIN(F17,J17),0),N17/L17))","v":0},null,{"$f":"IF(N17=0,0,P17/N17)","v":0},0,{"$f":"Berechnungstabellen!I11","v":0},null,{"$f":"A17","v":"Zuchtbullen"},{"$f":"Berechnungstabellen!J11","v":0},0]
["Geprüfte Maßangaben:"]
[]
["Anmerkungen / best. ANG´s"]
[]
["Stallblatt",{"$f":"B2+1","v":2},"Stallname (bei mehreren Ställen bzw. bei Anbinde- UND Laufstallhaltung f. Rinder > 2 Jahre in einem Stall: Je Stall bzw. Haltungsform ist das Formular jew. separat auszufüllen):",null,null,null,null,null,null,null,null,null,null,null,null,"Baujahr:"]
["Laufstall",null,"Stallgebäude",null,null,null,null,null,null,null,null,"Außenfläche (muss planbefestigt sein!)"]
["Anbindehaltung",null,null,null,"Stallfläche",null,null,null,"Stallboden",null,null,null,null,"Außenfläche",null,null,"Überdachung"]
[null,null,"Min. \nm²/Tier",{"$f":"D$5","v":"Box-nummer(n) lt. Stall-plan"},"Stall-fläche\nm² ","max. Tierzahl \nStallfläche","Anzahl Liege-plätze","davon Spaltenboden / perforiert m²","in %","max. Tierzahl \nStallboden","Belegung\naktuell","Min. \nm²/Tier","Zugang Sommer-weide möglich (Mai-Okt.)","\nAußen-fläche\nm² ","max. Tierzahl \nAußen-flächen","Über-dachung m2","Über-dachung %","max. Tierzahl \nÜber-dachung","Max. Tier-zahl"]
["Tiergruppe",null,null,null,null,null,null,"max. ",0.5,null,null,null,null,null,null,"max.",0.5]
["Kälber <1 Jahr <100kg",null,1.5,null,null,{"$f":"ROUNDDOWN(E27/C27,0)","v":0},null,null,{"$f":"IF(ISERROR(H27/E27),0,H27/E27)","v":0},{"$f":"IF(H27=0,F27,IF(ROUNDDOWN(E27/C27/(H27/(E27/2)),0)<(E27/C27),ROUNDDOWN(E27/C27/(H27/(E27/2)),0),ROUNDDOWN(E27/C27,0)))","v":0},null,1.1000000000000001,null,null,{"$f":"IF(M27=\"JA\",MIN(F27,G27),ROUNDDOWN(N27/L27,0))","v":0},null,{"$f":"IF(N27=0,0,P27/N27)","v":0},{"$f":"IF(M27=\"JA\",O27,IF(N27=0,0,IF(ROUNDDOWN((O27+(O27*-((P27-(N27*Q$26))/(N27-(N27*Q$26))))),0)>O27,O27,(ROUNDDOWN((O27+(O27*-((P27-(N27*Q$26))/(N27-(N27*Q$26))))),0)))))","v":0},{"$f":"Berechnungstabellen!I13","v":0}]
["Kälber <1 Jahr <200kg",null,2.5,null,null,{"$f":"ROUNDDOWN(E28/C28,0)","v":0},null,null,{"$f":"IF(ISERROR(H28/E28),0,H28/E28)","v":0},{"$f":"IF(H28=0,F28,IF(ROUNDDOWN(E28/C28/(H28/(E28/2)),0)<(E28/C28),ROUNDDOWN(E28/C28/(H28/(E28/2)),0),ROUNDDOWN(E28/C28,0)))","v":0},null,1.9,null,null,{"$f":"IF(M28=\"JA\",MIN(F28,G28),ROUNDDOWN(N28/L28,0))","v":0},null,{"$f":"IF(N28=0,0,P28/N28)","v":0},{"$f":"IF(M28=\"JA\",O28,IF(N28=0,0,IF(ROUNDDOWN((O28+(O28*-((P28-(N28*Q$26))/(N28-(N28*Q$26))))),0)>O28,O28,(ROUNDDOWN((O28+(O28*-((P28-(N28*Q$26))/(N28-(N28*Q$26))))),0)))))","v":0},{"$f":"Berechnungstabellen!I14","v":0}]
["Rinder 1-2 Jahr <350kg",null,4,null,null,{"$f":"ROUNDDOWN(E29/C29,0)","v":0},null,null,0,0,null,3,null,null,{"$f":"IF(M29=\"JA\",MIN(F29,G29),ROUNDDOWN(N29/L29,0))","v":0},null,{"$f":"IF(N29=0,0,P29/N29)","v":0},{"$f":"IF(M29=\"JA\",O29,IF(N29=0,0,IF(ROUNDDOWN((O29+(O29*-((P29-(N29*Q$26))/(N29-(N29*Q$26))))),0)>O29,O29,(ROUNDDOWN((O29+(O29*-((P29-(N29*Q$26))/(N29-(N29*Q$26))))),0)))))","v":0},{"$f":"Berechnungstabellen!I15","v":0}]
[]
["Milchkühe",null,6,null,null,{"$f":"IF(B24=\"JA\",G31,ROUNDDOWN(E31/C31,0))","v":0},null,null,{"$f":"IF(ISERROR(H31/E31),0,H31/E31)","v":0},0,null,4.5,null,null,{"$f":"IF($B$24=\"JA\",IF(M31=\"JA\",G31,ROUNDDOWN(N31/L31,0)),IF(M31=\"JA\",ROUNDDOWN(MIN(F31,J31),0),N31/L31))","v":0},null,{"$f":"IF(N31=0,0,P31/N31)","v":0},{"$f":"IF(M31=\"JA\",O31,IF(N31=0,0,IF(ROUNDDOWN((O31+(O31*-((P31-(N31*Q$26))/(N31-(N31*Q$26))))),0)>O31,O31,(ROUNDDOWN((O31+(O31*-((P31-(N31*Q$26))/(N31-(N31*Q$26))))),0)))))","v":0},{"$f":"Berechnungstabellen!I16","v":0}]
["Mutter-/ Ammenkühe",null,6,null,null,{"$f":"IF(B24=\"JA\",G32,ROUNDDOWN(E32/C32,0))","v":0},null,null,0,0,null,4.5,null,null,{"$f":"IF($B$24=\"JA\",IF(M32=\"JA\",G32,ROUNDDOWN(N32/L32,0)),IF(M32=\"JA\",ROUNDDOWN(MIN(F32,J32),0),N32/L32))","v":0},null,{"$f":"IF(N32=0,0,P32/N32)","v":0},{"$f":"IF(M32=\"JA\",O32,IF(N32=0,0,IF(ROUNDDOWN((O32+(O32*-((P32-(N32*Q$26))/(N32-(N32*Q$26))))),0)>O32,O32,(ROUNDDOWN((O32+(O32*-((P32-(N32*Q$26))/(N32-(N32*Q$26))))),0)))))","v":0},{"$f":"Berechnungstabellen!I17","v":0}]
[null,null,"1m²/100kg",null,null,null,null,null,null,null,null,"0,75m²/100kg"]
["Bullen >2 Jahr >350kg",null,5,null,null,{"$f":"ROUNDDOWN(E34/C34,0)","v":0},null,null,{"$f":"IF(ISERROR(H34/E34),0,H34/E34)","v":0},0,null,3.7,null,null,{"$f":"IF($B$24=\"JA\",IF(M34=\"JA\",G34,ROUNDDOWN(N34/L34,0)),IF(M34=\"JA\",ROUNDDOWN(MIN(F34,J34),0),N34/L34))","v":0},null,{"$f":"IF(N34=0,0,P34/N34)","v":0},{"$f":"IF(M34=\"JA\",O34,IF(N34=0,0,IF(ROUNDDOWN((O34+(O34*-((P34-(N34*Q$26))/(N34-(N34*Q$26))))),0)>O34,O34,(ROUNDDOWN((O34+(O34*-((P34-(N34*Q$26))/(N34-(N34*Q$26))))),0)))))","v":0},{"$f":"Berechnungstabellen!I18","v":0}]
["Färsen >2 Jahr >350kg",null,5,null,null,{"$f":"ROUNDDOWN(E35/C35,0)","v":0},null,null,0,0,null,3.7,null,null,{"$f":"IF($B$24=\"JA\",IF(M35=\"JA\",G35,ROUNDDOWN(N35/L35,0)),IF(M35=\"JA\",ROUNDDOWN(MIN(F35,J35),0),N35/L35))","v":0},null,{"$f":"IF(N35=0,0,P35/N35)","v":0},{"$f":"IF(M35=\"JA\",O35,IF(N35=0,0,IF(ROUNDDOWN((O35+(O35*-((P35-(N35*Q$26))/(N35-(N35*Q$26))))),0)>O35,O35,(ROUNDDOWN((O35+(O35*-((P35-(N35*Q$26))/(N35-(N35*Q$26))))),0)))))","v":0},{"$f":"Berechnungstabellen!I19","v":0}]
["bei Einzelhaltung; wenn Haltung in Herde mit weibl. Rindern, wird Zuchtbulle wie Rind der jew. Gruppe gezählt"]
["Zuchtbullen",null,10,null,null,{"$f":"ROUNDDOWN(E37/C37,0)","v":0},null,null,{"$f":"IF(ISERROR(H37/E37),0,H37/E37)","v":0},0,null,30,null,null,{"$f":"IF($B$24=\"JA\",IF(M37=\"JA\",G37,ROUNDDOWN(N37/L37,0)),IF(M37=\"JA\",ROUNDDOWN(MIN(F37,J37),0),N37/L37))","v":0},null,{"$f":"IF(N37=0,0,P37/N37)","v":0},{"$f":"IF(M37=\"JA\",O37,IF(N37=0,0,IF(ROUNDDOWN((O37+(O37*-((P37-(N37*Q$26))/(N37-(N37*Q$26))))),0)>O37,O37,(ROUNDDOWN((O37+(O37*-((P37-(N37*Q$26))/(N37-(N37*Q$26))))),0)))))","v":0},{"$f":"Berechnungstabellen!I20","v":0}]
["Geprüfte Maßangaben:"]
[]
["Anmerkungen / best. ANG´s"]
[]
["Stallblatt",{"$f":"B22+1","v":3},"Stallname (bei mehreren Ställen bzw. bei Anbinde- UND Laufstallhaltung f. Rinder > 2 Jahre in einem Stall: Je Stall bzw. Haltungsform ist das Formular jew. separat auszufüllen):",null,null,null,null,null,null,null,null,null,null,null,null,"Baujahr:"]
["Laufstall",null,"Stallgebäude",null,null,null,null,null,null,null,null,"Außenfläche (muss planbefestigt sein!)"]
["Anbindehaltung",null,null,null,"Stallfläche",null,null,null,"Stallboden",null,null,null,null,"Außenfläche",null,null,"Überdachung"]
[null,null,"Min. \nm²/Tier",{"$f":"D$5","v":"Box-nummer(n) lt. Stall-plan"},"Stall-fläche\nm² ","max. Tierzahl \nStallfläche","Anzahl Liege-plätze","davon Spaltenboden / perforiert m²","in %","max. Tierzahl \nStallboden","Belegung\naktuell","Min. \nm²/Tier","Zugang Sommer-weide möglich (Mai-Okt.)","\nAußen-fläche\nm² ","max. Tierzahl \nAußen-flächen","Über-dachung m2","Über-dachung %","max. Tierzahl \nÜber-dachung","Max. Tier-zahl"]
["Tiergruppe",null,null,null,null,null,null,"max. ",0.5,null,null,null,null,null,null,"max.",0.5]
["Kälber <1 Jahr <100kg",null,1.5,null,null,{"$f":"ROUNDDOWN(E47/C47,0)","v":0},null,null,{"$f":"IF(ISERROR(H47/E47),0,H47/E47)","v":0},{"$f":"IF(H47=0,F47,IF(ROUNDDOWN(E47/C47/(H47/(E47/2)),0)<(E47/C47),ROUNDDOWN(E47/C47/(H47/(E47/2)),0),ROUNDDOWN(E47/C47,0)))","v":0},null,1.1000000000000001,null,null,{"$f":"IF(M47=\"JA\",MIN(F47,G47),ROUNDDOWN(N47/L47,0))","v":0},null,{"$f":"IF(N47=0,0,P47/N47)","v":0},{"$f":"IF(M47=\"JA\",O47,IF(N47=0,0,IF(ROUNDDOWN((O47+(O47*-((P47-(N47*Q$46))/(N47-(N47*Q$46))))),0)>O47,O47,(ROUNDDOWN((O47+(O47*-((P47-(N47*Q$46))/(N47-(N47*Q$46))))),0)))))","v":0},{"$f":"Berechnungstabellen!I22","v":0}]
["Kälber <1 Jahr <200kg",null,2.5,null,null,{"$f":"ROUNDDOWN(E48/C48,0)","v":0},null,null,{"$f":"IF(ISERROR(H48/E48),0,H48/E48)","v":0},{"$f":"IF(H48=0,F48,IF(ROUNDDOWN(E48/C48/(H48/(E48/2)),0)<(E48/C48),ROUNDDOWN(E48/C48/(H48/(E48/2)),0),ROUNDDOWN(E48/C48,0)))","v":0},null,1.9,null,null,{"$f":"IF(M48=\"JA\",MIN(F48,G48),ROUNDDOWN(N48/L48,0))","v":0},null,{"$f":"IF(N48=0,0,P48/N48)","v":0},{"$f":"IF(M48=\"JA\",O48,IF(N48=0,0,IF(ROUNDDOWN((O48+(O48*-((P48-(N48*Q$46))/(N48-(N48*Q$46))))),0)>O48,O48,(ROUNDDOWN((O48+(O48*-((P48-(N48*Q$46))/(N48-(N48*Q$46))))),0)))))","v":0},{"$f":"Berechnungstabellen!I23","v":0}]
["Rinder 1-2 Jahr <350kg",null,4,null,null,{"$f":"ROUNDDOWN(E49/C49,0)","v":0},null,null,0,0,null,3,null,null,{"$f":"IF(M49=\"JA\",MIN(F49,G49),ROUNDDOWN(N49/L49,0))","v":0},null,{"$f":"IF(N49=0,0,P49/N49)","v":0},{"$f":"IF(M49=\"JA\",O49,IF(N49=0,0,IF(ROUNDDOWN((O49+(O49*-((P49-(N49*Q$46))/(N49-(N49*Q$46))))),0)>O49,O49,(ROUNDDOWN((O49+(O49*-((P49-(N49*Q$46))/(N49-(N49*Q$46))))),0)))))","v":0},{"$f":"Berechnungstabellen!I24","v":0}]
[]
["Milchkühe",null,6,null,null,{"$f":"IF(B44=\"JA\",G51,ROUNDDOWN(E51/C51,0))","v":0},null,null,{"$f":"IF(ISERROR(H51/E51),0,H51/E51)","v":0},0,null,4.5,null,null,{"$f":"IF($B$44=\"JA\",IF(M51=\"JA\",G51,ROUNDDOWN(N51/L51,0)),IF(M51=\"JA\",ROUNDDOWN(MIN(F51,J51),0),N51/L51))","v":0},null,{"$f":"IF(N51=0,0,P51/N51)","v":0},{"$f":"IF(M51=\"JA\",O51,IF(N51=0,0,IF(ROUNDDOWN((O51+(O51*-((P51-(N51*Q$46))/(N51-(N51*Q$46))))),0)>O51,O51,(ROUNDDOWN((O51+(O51*-((P51-(N51*Q$46))/(N51-(N51*Q$46))))),0)))))","v":0},{"$f":"Berechnungstabellen!I25","v":0}]
["Mutter-/ Ammenkühe",null,6,null,null,{"$f":"IF(B44=\"JA\",G52,ROUNDDOWN(E52/C52,0))","v":0},null,null,0,0,null,4.5,null,null,{"$f":"IF($B$44=\"JA\",IF(M52=\"JA\",G52,ROUNDDOWN(N52/L52,0)),IF(M52=\"JA\",ROUNDDOWN(MIN(F52,J52),0),N52/L52))","v":0},null,{"$f":"IF(N52=0,0,P52/N52)","v":0},{"$f":"IF(M52=\"JA\",O52,IF(N52=0,0,IF(ROUNDDOWN((O52+(O52*-((P52-(N52*Q$46))/(N52-(N52*Q$46))))),0)>O52,O52,(ROUNDDOWN((O52+(O52*-((P52-(N52*Q$46))/(N52-(N52*Q$46))))),0)))))","v":0},{"$f":"Berechnungstabellen!I26","v":0}]
[null,null,"1m²/100kg",null,null,null,null,null,null,null,null,"0,75m²/100kg"]
["Bullen >2 Jahr >350kg",null,5,null,null,{"$f":"ROUNDDOWN(E54/C54,0)","v":0},null,null,{"$f":"IF(ISERROR(H54/E54),0,H54/E54)","v":0},0,null,3.7,null,null,{"$f":"IF($B$44=\"JA\",IF(M54=\"JA\",G54,ROUNDDOWN(N54/L54,0)),IF(M54=\"JA\",ROUNDDOWN(MIN(F54,J54),0),N54/L54))","v":0},null,{"$f":"IF(N54=0,0,P54/N54)","v":0},{"$f":"IF(M54=\"JA\",O54,IF(N54=0,0,IF(ROUNDDOWN((O54+(O54*-((P54-(N54*Q$46))/(N54-(N54*Q$46))))),0)>O54,O54,(ROUNDDOWN((O54+(O54*-((P54-(N54*Q$46))/(N54-(N54*Q$46))))),0)))))","v":0},{"$f":"Berechnungstabellen!I27","v":0}]
["Färsen >2 Jahr >350kg",null,5,null,null,{"$f":"ROUNDDOWN(E55/C55,0)","v":0},null,null,0,0,null,3.7,null,null,{"$f":"IF($B$44=\"JA\",IF(M55=\"JA\",G55,ROUNDDOWN(N55/L55,0)),IF(M55=\"JA\",ROUNDDOWN(MIN(F55,J55),0),N55/L55))","v":0},null,{"$f":"IF(N55=0,0,P55/N55)","v":0},{"$f":"IF(M55=\"JA\",O55,IF(N55=0,0,IF(ROUNDDOWN((O55+(O55*-((P55-(N55*Q$46))/(N55-(N55*Q$46))))),0)>O55,O55,(ROUNDDOWN((O55+(O55*-((P55-(N55*Q$46))/(N55-(N55*Q$46))))),0)))))","v":0},{"$f":"Berechnungstabellen!I28","v":0}]
["bei Einzelhaltung; wenn Haltung in Herde mit weibl. Rindern, wird Zuchtbulle wie Rind der jew. Gruppe gezählt"]
["Zuchtbullen",null,10,null,null,{"$f":"ROUNDDOWN(E57/C57,0)","v":0},null,null,{"$f":"IF(ISERROR(H57/E57),0,H57/E57)","v":0},0,null,30,null,null,{"$f":"IF($B$44=\"JA\",IF(M57=\"JA\",G57,ROUNDDOWN(N57/L57,0)),IF(M57=\"JA\",ROUNDDOWN(MIN(F57,J57),0),N57/L57))","v":0},null,{"$f":"IF(N57=0,0,P57/N57)","v":0},{"$f":"IF(M57=\"JA\",O57,IF(N57=0,0,IF(ROUNDDOWN((O57+(O57*-((P57-(N57*Q$46))/(N57-(N57*Q$46))))),0)>O57,O57,(ROUNDDOWN((O57+(O57*-((P57-(N57*Q$46))/(N57-(N57*Q$46))))),0)))))","v":0},{"$f":"Berechnungstabellen!I29","v":0}]
["Geprüfte Maßangaben:"]
[]
["Anmerkungen / best. ANG´s"]
[]
["Stallblatt",{"$f":"B42+1","v":4},"Stallname (bei mehreren Ställen bzw. bei Anbinde- UND Laufstallhaltung f. Rinder > 2 Jahre in einem Stall: Je Stall bzw. Haltungsform ist das Formular jew. separat auszufüllen):",null,null,null,null,null,null,null,null,null,null,null,null,"Baujahr:"]
["Laufstall",null,"Stallgebäude",null,null,null,null,null,null,null,null,"Außenfläche (muss planbefestigt sein!)"]
["Anbindehaltung",null,null,null,"Stallfläche",null,null,null,"Stallboden",null,null,null,null,"Außenfläche",null,null,"Überdachung"]
[null,null,"Min. \nm²/Tier",{"$f":"D$5","v":"Box-nummer(n) lt. Stall-plan"},"Stall-fläche\nm² ","max. Tierzahl \nStallfläche","Anzahl Liege-plätze","davon Spaltenboden / perforiert m²","in %","max. Tierzahl \nStallboden","Belegung\naktuell","Min. \nm²/Tier","Zugang Sommer-weide möglich (Mai-Okt.)","\nAußen-fläche\nm² ","max. Tierzahl \nAußen-flächen","Über-dachung m2","Über-dachung %","max. Tierzahl \nÜber-dachung","Max. Tier-zahl"]
["Tiergruppe",null,null,null,null,null,null,"max. ",0.5,null,null,null,null,null,null,"max.",0.5]
["Kälber <1 Jahr <100kg",null,1.5,null,null,{"$f":"ROUNDDOWN(E67/C67,0)","v":0},null,null,{"$f":"IF(ISERROR(H67/E67),0,H67/E67)","v":0},{"$f":"IF(H67=0,F67,IF(ROUNDDOWN(E67/C67/(H67/(E67/2)),0)<(E67/C67),ROUNDDOWN(E67/C67/(H67/(E67/2)),0),ROUNDDOWN(E67/C67,0)))","v":0},null,1.1000000000000001,null,null,{"$f":"IF(M67=\"JA\",MIN(F67,G67),ROUNDDOWN(N67/L67,0))","v":0},null,{"$f":"IF(N67=0,0,P67/N67)","v":0},{"$f":"IF(M67=\"JA\",O67,IF(N67=0,0,IF(ROUNDDOWN((O67+(O67*-((P67-(N67*Q$66))/(N67-(N67*Q$66))))),0)>O67,O67,(ROUNDDOWN((O67+(O67*-((P67-(N67*Q$66))/(N67-(N67*Q$66))))),0)))))","v":0},{"$f":"Berechnungstabellen!I31","v":0}]
["Kälber <1 Jahr <200kg",null,2.5,null,null,{"$f":"ROUNDDOWN(E68/C68,0)","v":0},null,null,{"$f":"IF(ISERROR(H68/E68),0,H68/E68)","v":0},{"$f":"IF(H68=0,F68,IF(ROUNDDOWN(E68/C68/(H68/(E68/2)),0)<(E68/C68),ROUNDDOWN(E68/C68/(H68/(E68/2)),0),ROUNDDOWN(E68/C68,0)))","v":0},null,1.9,null,null,{"$f":"IF(M68=\"JA\",MIN(F68,G68),ROUNDDOWN(N68/L68,0))","v":0},null,{"$f":"IF(N68=0,0,P68/N68)","v":0},{"$f":"IF(M68=\"JA\",O68,IF(N68=0,0,IF(ROUNDDOWN((O68+(O68*-((P68-(N68*Q$66))/(N68-(N68*Q$66))))),0)>O68,O68,(ROUNDDOWN((O68+(O68*-((P68-(N68*Q$66))/(N68-(N68*Q$66))))),0)))))","v":0},{"$f":"Berechnungstabellen!I32","v":0}]
["Rinder 1-2 Jahr <350kg",null,4,null,null,{"$f":"ROUNDDOWN(E69/C69,0)","v":0},null,null,0,0,null,3,null,null,{"$f":"IF(M69=\"JA\",MIN(F69,G69),ROUNDDOWN(N69/L69,0))","v":0},null,{"$f":"IF(N69=0,0,P69/N69)","v":0},{"$f":"IF(M69=\"JA\",O69,IF(N69=0,0,IF(ROUNDDOWN((O69+(O69*-((P69-(N69*Q$66))/(N69-(N69*Q$66))))),0)>O69,O69,(ROUNDDOWN((O69+(O69*-((P69-(N69*Q$66))/(N69-(N69*Q$66))))),0)))))","v":0},{"$f":"Berechnungstabellen!I33","v":0}]
[]
["Milchkühe",null,6,null,null,{"$f":"IF(B64=\"JA\",G71,ROUNDDOWN(E71/C71,0))","v":0},null,null,{"$f":"IF(ISERROR(H71/E71),0,H71/E71)","v":0},0,null,4.5,null,null,{"$f":"IF($B$64=\"JA\",IF(M71=\"JA\",G71,ROUNDDOWN(N71/L71,0)),IF(M71=\"JA\",ROUNDDOWN(MIN(F71,J71),0),N71/L71))","v":0},null,{"$f":"IF(N71=0,0,P71/N71)","v":0},{"$f":"IF(M71=\"JA\",O71,IF(N71=0,0,IF(ROUNDDOWN((O71+(O71*-((P71-(N71*Q$66))/(N71-(N71*Q$66))))),0)>O71,O71,(ROUNDDOWN((O71+(O71*-((P71-(N71*Q$66))/(N71-(N71*Q$66))))),0)))))","v":0},{"$f":"Berechnungstabellen!I34","v":0}]
["Mutter-/ Ammenkühe",null,6,null,null,{"$f":"IF(B64=\"JA\",G72,ROUNDDOWN(E72/C72,0))","v":0},null,null,0,0,null,4.5,null,null,{"$f":"IF($B$64=\"JA\",IF(M72=\"JA\",G72,ROUNDDOWN(N72/L72,0)),IF(M72=\"JA\",ROUNDDOWN(MIN(F72,J72),0),N72/L72))","v":0},null,{"$f":"IF(N72=0,0,P72/N72)","v":0},{"$f":"IF(M72=\"JA\",O72,IF(N72=0,0,IF(ROUNDDOWN((O72+(O72*-((P72-(N72*Q$66))/(N72-(N72*Q$66))))),0)>O72,O72,(ROUNDDOWN((O72+(O72*-((P72-(N72*Q$66))/(N72-(N72*Q$66))))),0)))))","v":0},{"$f":"Berechnungstabellen!I35","v":0}]
[null,null,"1m²/100kg",null,null,null,null,null,null,null,null,"0,75m²/100kg"]
["Bullen >2 Jahr >350kg",null,5,null,null,{"$f":"ROUNDDOWN(E74/C74,0)","v":0},null,null,{"$f":"IF(ISERROR(H74/E74),0,H74/E74)","v":0},0,null,3.7,null,null,{"$f":"IF($B$64=\"JA\",IF(M74=\"JA\",G74,ROUNDDOWN(N74/L74,0)),IF(M74=\"JA\",ROUNDDOWN(MIN(F74,J74),0),N74/L74))","v":0},null,{"$f":"IF(N74=0,0,P74/N74)","v":0},{"$f":"IF(M74=\"JA\",O74,IF(N74=0,0,IF(ROUNDDOWN((O74+(O74*-((P74-(N74*Q$66))/(N74-(N74*Q$66))))),0)>O74,O74,(ROUNDDOWN((O74+(O74*-((P74-(N74*Q$66))/(N74-(N74*Q$66))))),0)))))","v":0},{"$f":"Berechnungstabellen!I36","v":0}]
["Färsen >2 Jahr >350kg",null,5,null,null,{"$f":"ROUNDDOWN(E75/C75,0)","v":0},null,null,0,0,null,3.7,null,null,{"$f":"IF($B$64=\"JA\",IF(M75=\"JA\",G75,ROUNDDOWN(N75/L75,0)),IF(M75=\"JA\",ROUNDDOWN(MIN(F75,J75),0),N75/L75))","v":0},null,{"$f":"IF(N75=0,0,P75/N75)","v":0},{"$f":"IF(M75=\"JA\",O75,IF(N75=0,0,IF(ROUNDDOWN((O75+(O75*-((P75-(N75*Q$66))/(N75-(N75*Q$66))))),0)>O75,O75,(ROUNDDOWN((O75+(O75*-((P75-(N75*Q$66))/(N75-(N75*Q$66))))),0)))))","v":0},{"$f":"Berechnungstabellen!I37","v":0}]
["bei Einzelhaltung; wenn Haltung in Herde mit weibl. Rindern, wird Zuchtbulle wie Rind der jew. Gruppe gezählt"]
["Zuchtbullen",null,10,null,null,{"$f":"ROUNDDOWN(E77/C77,0)","v":0},null,null,{"$f":"IF(ISERROR(H77/E77),0,H77/E77)","v":0},0,null,30,null,null,{"$f":"IF($B$64=\"JA\",IF(M77=\"JA\",G77,ROUNDDOWN(N77/L77,0)),IF(M77=\"JA\",ROUNDDOWN(MIN(F77,J77),0),N77/L77))","v":0},null,{"$f":"IF(N77=0,0,P77/N77)","v":0},{"$f":"IF(M77=\"JA\",O77,IF(N77=0,0,IF(ROUNDDOWN((O77+(O77*-((P77-(N77*Q$66))/(N77-(N77*Q$66))))),0)>O77,O77,(ROUNDDOWN((O77+(O77*-((P77-(N77*Q$66))/(N77-(N77*Q$66))))),0)))))","v":0},{"$f":"Berechnungstabellen!I38","v":0}]
["Geprüfte Maßangaben:"]
[]
["Anmerkungen / best. ANG´s"]

{"sheet":"Kl. Wiederkäuer_Equidien","index":3,"n_rows":76,"n_cols":22,"rows_kept":76,"cut":false,"hidden":false,"merged":[[52,0,52,1],[70,0,70,1],[71,0,71,1],[13,0,13,1],[14,0,14,1],[32,0,32,1],[33,0,33,1],[51,0,51,1],[69,0,69,1],[61,0,61,1],[63,0,63,1],[64,0,64,1],[66,0,66,1],[67,0,67,1],[42,0,42,1],[44,0,44,1],[75,3,75,17],[56,3,56,17],[37,3,37,17],[18,3,18,17],[12,0,12,1],[15,0,15,1],[23,0,23,1],[25,0,25,1],[26,0,26,1],[28,0,28,1],[29,0,29,1],[72,0,72,1],[31,0,31,1],[34,0,34,1],[50,0,50,1],[53,0,53,1],[58,10,58,12],[73,3,73,17],[54,3,54,17],[35,3,35,17],[16,3,16,17],[47,0,47,1],[48,0,48,1],[1,10,1,12],[20,10,20,12],[39,10,39,12],[4,0,4,1],[7,0,7,1],[6,0,6,1],[10,0,10,1],[9,0,9,1],[8,19,8,21],[11,19,11,21],[4,19,4,21],[2,19,3,21],[45,0,45,1]]}
["Ermittlung der maximalen Tierzahl, die gem. EU VO 2018/848 sowie 2020-464 Anhang I je Stallblatt gehalten werden darf",null,null,null,null,null,null,null,null,null,null,null,null,null,null,null,null,"Kleine Wiederkäuer"]
["Stallblatt",1,"Stallname (bei mehreren Ställen: Je Stall ist das Formular jew. separat auszufüllen):",null,null,null,null,null,null,null,null,null,null,null,"Baujahr:"]
[null,null,"Stallgebäude",null,null,null,null,null,null,null,"Außenfläche (muss planbefestigt sein!)",null,null,null,null,null,null,null,null,"Zum Abgleich Eingabe Ecert mit HITier Tagesbestand"]
[null,null,null,null,"Stallfläche",null,null,"Stallboden"]
["Tiergruppe",null,"benötigte \nm²/Tier","Box-nummer(n) lt. Stall-plan","Stall-fläche\nm² ","max. Tierzahl \nStallfläche","davon Spalten-boden / perforiert\nm²","in %","max. Tierzahl \nStall-boden","Belegung\naktuell","benötigte \nm²/Tier","Zugang Weide möglich (Mai-Okt.)","\nAußen-fläche\nm² ","max. Tierzahl \nAußen-flächen","Über-dachung m2","Über-dachung %","max. Tierzahl \nÜber-dachung","Max. Tier-zahl",null,"Tierzahl ges. über alle Ställe"]
["Schafe",null,null,null,null,null,"max. ",0.5,null,null,null,null,null,null,"max.",0.5,null,null,null,null,"Max Tierzahl ges.","Gehaltene Tiere"]
["Lamm (< 1J)",null,0.35,null,null,{"$f":"ROUNDDOWN(E7/C7,0)","v":0},null,{"$f":"IF(ISERROR(G7/E7),0,G7/E7)","v":0},{"$f":"IF(G7=0,F7,IF(ROUNDDOWN(E7/C7/(G7/(E7/2)),0)<(E7/C7),ROUNDDOWN(E7/C7/(G7/(E7/2)),0),ROUNDDOWN(E7/C7,0)))","v":0},null,0.5,null,null,{"$f":"IF(L7=\"JA\",MIN(F7,I7),ROUNDDOWN(M7/K7,0))","v":0},null,{"$f":"IF(M7=0,0,O7/M7)","v":0},{"$f":"IF(L7=\"JA\",N7,IF(M7=0,0,IF(ROUNDDOWN((N7+(N7*-((O7-(M7*P$6))/(M7-(M7*P$6))))),0)>N7,N7,(ROUNDDOWN((N7+(N7*-((O7-(M7*P$6))/(M7-(M7*P$6))))),0)))))","v":0},{"$f":"Berechnungstabellen!I41","v":0},null,{"$f":"A7","v":"Lamm (< 1J)"},{"$f":"Berechnungstabellen!J41","v":0},{"$f":"J7+J26+J45+J64","v":0}]
["Mutter-/ Milchschaf",null,1.5,null,null,{"$f":"ROUNDDOWN(E8/C8,0)","v":0},null,{"$f":"IF(ISERROR(G8/E8),0,G8/E8)","v":0},{"$f":"IF(G8=0,F8,IF(ROUNDDOWN(E8/C8/(G8/(E8/2)),0)<(E8/C8),ROUNDDOWN(E8/C8/(G8/(E8/2)),0),ROUNDDOWN(E8/C8,0)))","v":0},null,2.5,null,null,{"$f":"IF(L8=\"JA\",MIN(F8,I8),ROUNDDOWN(M8/K8,0))","v":0},null,{"$f":"IF(M8=0,0,O8/M8)","v":0},{"$f":"IF(L8=\"JA\",N8,IF(M8=0,0,IF(ROUNDDOWN((N8+(N8*-((O8-(M8*P$6))/(M8-(M8*P$6))))),0)>N8,N8,(ROUNDDOWN((N8+(N8*-((O8-(M8*P$6))/(M8-(M8*P$6))))),0)))))","v":0},{"$f":"Berechnungstabellen!I42","v":0},null,"Mutter-/ Milchschaf",{"$f":"Berechnungstabellen!J42","v":0},{"$f":"J8+J27+J46+J65","v":0}]
["Ziegen",null,null,null,null,null,null,null,null,null,null,null,null,null,null,null,null,null,null,"Ziegen"]
["Ziegenlamm (< 1J)",null,0.35,null,null,{"$f":"ROUNDDOWN(E10/C10,0)","v":0},null,{"$f":"IF(ISERROR(G10/E10),0,G10/E10)","v":0},{"$f":"IF(G10=0,F10,IF(ROUNDDOWN(E10/C10/(G10/(E10/2)),0)<(E10/C10),ROUNDDOWN(E10/C10/(G10/(E10/2)),0),ROUNDDOWN(E10/C10,0)))","v":0},null,0.5,null,null,{"$f":"IF(L10=\"JA\",MIN(F10,I10),ROUNDDOWN(M10/K10,0))","v":0},null,{"$f":"IF(M10=0,0,O10/M10)","v":0},0,{"$f":"Berechnungstabellen!I44","v":0},null,"Ziegenlamm (< 1J)",{"$f":"Berechnungstabellen!J44","v":0},{"$f":"J10+J29+J48+J67","v":0}]
["Ziegen",null,1.5,null,null,{"$f":"ROUNDDOWN(E11/C11,0)","v":0},null,{"$f":"IF(ISERROR(G11/E11),0,G11/E11)","v":0},{"$f":"IF(G11=0,F11,IF(ROUNDDOWN(E11/C11/(G11/(E11/2)),0)<(E11/C11),ROUNDDOWN(E11/C11/(G11/(E11/2)),0),ROUNDDOWN(E11/C11,0)))","v":0},null,2.5,null,null,{"$f":"IF(L11=\"JA\",MIN(F11,I11),ROUNDDOWN(M11/K11,0))","v":0},null,{"$f":"IF(M11=0,0,O11/M11)","v":0},0,{"$f":"Berechnungstabellen!I45","v":0},null,"Ziegen",{"$f":"Berechnungstabellen!J45","v":0},{"$f":"J11+J30+J49+J68","v":0}]
["Pferde",null,"mind. 1m²/100kg",null,null,null,null,null,null,null,"mind. 0,75m²/100kg",null,null,null,null,null,null,null,null,"Pferde"]
["Pferde < 100 kg ",null,1.5,null,null,{"$f":"ROUNDDOWN(E13/C13,0)","v":0},null,{"$f":"IF(ISERROR(G13/E13),0,G13/E13)","v":0},{"$f":"IF(G13=0,F13,IF(ROUNDDOWN(E13/C13/(G13/(E13/2)),0)<(E13/C13),ROUNDDOWN(E13/C13/(G13/(E13/2)),0),ROUNDDOWN(E13/C13,0)))","v":0},null,1.1000000000000001,null,null,{"$f":"IF(L13=\"JA\",MIN(F13,I13),ROUNDDOWN(M13/K13,0))","v":0},null,{"$f":"IF(M13=0,0,O13/M13)","v":0},{"$f":"IF(L13=\"JA\",N13,IF(M13=0,0,IF(ROUNDDOWN((N13+(N13*-((O13-(M13*P$6))/(M13-(M13*P$6))))),0)>N13,N13,(ROUNDDOWN((N13+(N13*-((O13-(M13*P$6))/(M13-(M13*P$6))))),0)))))","v":0},{"$f":"Berechnungstabellen!I47","v":0},null,"Pferde < 6 Monate",{"$f":"Berechnungstabellen!J47","v":0},{"$f":"J13+J32+J51+J70","v":0}]
["Pferde bis 200 kg ",null,2.5,null,null,{"$f":"ROUNDDOWN(E14/C14,0)","v":0},null,{"$f":"IF(ISERROR(G14/E14),0,G14/E14)","v":0},{"$f":"IF(G14=0,F14,IF(ROUNDDOWN(E14/C14/(G14/(E14/2)),0)<(E14/C14),ROUNDDOWN(E14/C14/(G14/(E14/2)),0),ROUNDDOWN(E14/C14,0)))","v":0},null,1.9,null,null,{"$f":"IF(L14=\"JA\",MIN(F14,I14),ROUNDDOWN(M14/K14,0))","v":0},null,{"$f":"IF(M14=0,0,O14/M14)","v":0},{"$f":"IF(L14=\"JA\",N14,IF(M14=0,0,IF(ROUNDDOWN((N14+(N14*-((O14-(M14*P$6))/(M14-(M14*P$6))))),0)>N14,N14,(ROUNDDOWN((N14+(N14*-((O14-(M14*P$6))/(M14-(M14*P$6))))),0)))))","v":0},{"$f":"Berechnungstabellen!I48","v":0},null,"Pferde > 6 Monat",{"$f":"Berechnungstabellen!J48+Berechnungstabellen!J49+Berechnungstabellen!J50","v":0},{"$f":"SUM(J14:J16)+SUM(J33:J35)+SUM(J52:J54)+SUM(J71:J73)","v":0}]
["Pferde bis 350 kg ",null,4,null,null,0,null,0,0,null,3,null,null,0,null,0,0,{"$f":"Berechnungstabellen!I49","v":0}]
["Pferde über 350 kg ",null,5,null,null,{"$f":"ROUNDDOWN(E16/C16,0)","v":0},null,{"$f":"IF(ISERROR(G16/E16),0,G16/E16)","v":0},{"$f":"IF(G16=0,F16,IF(ROUNDDOWN(E16/C16/(G16/(E16/2)),0)<(E16/C16),ROUNDDOWN(E16/C16/(G16/(E16/2)),0),ROUNDDOWN(E16/C16,0)))","v":0},null,3.7,null,null,{"$f":"IF(L16=\"JA\",MIN(F16,I16),ROUNDDOWN(M16/K16,0))","v":0},null,{"$f":"IF(M16=0,0,O16/M16)","v":0},0,{"$f":"Berechnungstabellen!I50","v":0}]
["Geprüfte Maßangaben:"]
[]
["Anmerkungen / best. ANG´s"]
[]
["Stallblatt",{"$f":"B2+1","v":2},"Stallname (bei mehreren Ställen: Je Stall ist das Formular jew. separat auszufüllen):",null,null,null,null,null,null,null,null,null,null,null,"Baujahr:"]
[null,null,"Stallgebäude",null,null,null,null,null,null,null,"Außenfläche (muss planbefestigt sein!)"]
[null,null,null,null,"Stallfläche",null,null,"Stallboden"]
["Tiergruppe",null,"benötigte \nm²/Tier","Box-nummer(n) lt. Stall-plan","Stall-fläche\nm² ","max. Tierzahl \nStallfläche","davon Spalten-boden / perforiert\nm²","in %","max. Tierzahl \nStall-boden","Belegung\naktuell","benötigte \nm²/Tier","Zugang Weide möglich (Mai-Okt.)","\nAußen-fläche\nm² ","max. Tierzahl \nAußen-flächen","Über-dachung m2","Über-dachung %","max. Tierzahl \nÜber-dachung","Max. Tier-zahl"]
["Schafe",null,null,null,null,null,"max. ",0.5,null,null,null,null,null,null,"max.",0.5]
["Lamm (< 1J)",null,0.35,null,null,{"$f":"ROUNDDOWN(E26/C26,0)","v":0},null,{"$f":"IF(ISERROR(G26/E26),0,G26/E26)","v":0},{"$f":"IF(G26=0,F26,IF(ROUNDDOWN(E26/C26/(G26/(E26/2)),0)<(E26/C26),ROUNDDOWN(E26/C26/(G26/(E26/2)),0),ROUNDDOWN(E26/C26,0)))","v":0},null,0.5,null,null,{"$f":"IF(L26=\"JA\",MIN(F26,I26),ROUNDDOWN(M26/K26,0))","v":0},null,{"$f":"IF(M26=0,0,O26/M26)","v":0},{"$f":"IF(L26=\"JA\",N26,IF(M26=0,0,IF(ROUNDDOWN((N26+(N26*-((O26-(M26*P$6))/(M26-(M26*P$6))))),0)>N26,N26,(ROUNDDOWN((N26+(N26*-((O26-(M26*P$6))/(M26-(M26*P$6))))),0)))))","v":0},{"$f":"Berechnungstabellen!I52","v":0}]
["Mutter-/ Milchschaf",null,1.5,null,null,{"$f":"ROUNDDOWN(E27/C27,0)","v":0},null,{"$f":"IF(ISERROR(G27/E27),0,G27/E27)","v":0},{"$f":"IF(G27=0,F27,IF(ROUNDDOWN(E27/C27/(G27/(E27/2)),0)<(E27/C27),ROUNDDOWN(E27/C27/(G27/(E27/2)),0),ROUNDDOWN(E27/C27,0)))","v":0},null,2.5,null,null,{"$f":"IF(L27=\"JA\",MIN(F27,I27),ROUNDDOWN(M27/K27,0))","v":0},null,{"$f":"IF(M27=0,0,O27/M27)","v":0},{"$f":"IF(L27=\"JA\",N27,IF(M27=0,0,IF(ROUNDDOWN((N27+(N27*-((O27-(M27*P$6))/(M27-(M27*P$6))))),0)>N27,N27,(ROUNDDOWN((N27+(N27*-((O27-(M27*P$6))/(M27-(M27*P$6))))),0)))))","v":0},{"$f":"Berechnungstabellen!I53","v":0}]
["Ziegen"]
["Ziegenlamm (< 1J)",null,0.35,null,null,{"$f":"ROUNDDOWN(E29/C29,0)","v":0},null,{"$f":"IF(ISERROR(G29/E29),0,G29/E29)","v":0},{"$f":"IF(G29=0,F29,IF(ROUNDDOWN(E29/C29/(G29/(E29/2)),0)<(E29/C29),ROUNDDOWN(E29/C29/(G29/(E29/2)),0),ROUNDDOWN(E29/C29,0)))","v":0},null,0.5,null,null,{"$f":"IF(L29=\"JA\",MIN(F29,I29),ROUNDDOWN(M29/K29,0))","v":0},null,{"$f":"IF(M29=0,0,O29/M29)","v":0},{"$f":"IF(L29=\"JA\",N29,IF(M29=0,0,IF(ROUNDDOWN((N29+(N29*-((O29-(M29*P$6))/(M29-(M29*P$6))))),0)>N29,N29,(ROUNDDOWN((N29+(N29*-((O29-(M29*P$6))/(M29-(M29*P$6))))),0)))))","v":0},{"$f":"Berechnungstabellen!I55","v":0}]
["Ziegen",null,1.5,null,null,{"$f":"ROUNDDOWN(E30/C30,0)","v":0},null,{"$f":"IF(ISERROR(G30/E30),0,G30/E30)","v":0},{"$f":"IF(G30=0,F30,IF(ROUNDDOWN(E30/C30/(G30/(E30/2)),0)<(E30/C30),ROUNDDOWN(E30/C30/(G30/(E30/2)),0),ROUNDDOWN(E30/C30,0)))","v":0},null,2.5,null,null,{"$f":"IF(L30=\"JA\",MIN(F30,I30),ROUNDDOWN(M30/K30,0))","v":0},null,{"$f":"IF(M30=0,0,O30/M30)","v":0},0,{"$f":"Berechnungstabellen!I56","v":0}]
["Pferde",null,"1m²/100kg",null,null,null,null,null,null,null,"0,75m²/100kg"]
["Pferde < 100 kg ",null,1.5,null,null,{"$f":"ROUNDDOWN(E32/C32,0)","v":0},null,{"$f":"IF(ISERROR(G32/E32),0,G32/E32)","v":0},{"$f":"IF(G32=0,F32,IF(ROUNDDOWN(E32/C32/(G32/(E32/2)),0)<(E32/C32),ROUNDDOWN(E32/C32/(G32/(E32/2)),0),ROUNDDOWN(E32/C32,0)))","v":0},null,1.1000000000000001,null,null,{"$f":"IF(L32=\"JA\",MIN(F32,I32),ROUNDDOWN(M32/K32,0))","v":0},null,{"$f":"IF(M32=0,0,O32/M32)","v":0},{"$f":"IF(L32=\"JA\",N32,IF(M32=0,0,IF(ROUNDDOWN((N32+(N32*-((O32-(M32*P$6))/(M32-(M32*P$6))))),0)>N32,N32,(ROUNDDOWN((N32+(N32*-((O32-(M32*P$6))/(M32-(M32*P$6))))),0)))))","v":0},{"$f":"Berechnungstabellen!I58","v":0}]
["Pferde bis 200 kg ",null,2.5,null,null,{"$f":"ROUNDDOWN(E33/C33,0)","v":0},null,{"$f":"IF(ISERROR(G33/E33),0,G33/E33)","v":0},{"$f":"IF(G33=0,F33,IF(ROUNDDOWN(E33/C33/(G33/(E33/2)),0)<(E33/C33),ROUNDDOWN(E33/C33/(G33/(E33/2)),0),ROUNDDOWN(E33/C33,0)))","v":0},null,1.9,null,null,{"$f":"IF(L33=\"JA\",MIN(F33,I33),ROUNDDOWN(M33/K33,0))","v":0},null,{"$f":"IF(M33=0,0,O33/M33)","v":0},0,{"$f":"Berechnungstabellen!I59","v":0}]
["Pferde bis 350 kg ",null,4,null,null,0,null,0,0,null,3,null,null,0,null,0,0,{"$f":"Berechnungstabellen!I60","v":0}]
["Pferde über 350 kg ",null,5,null,null,{"$f":"ROUNDDOWN(E35/C35,0)","v":0},null,{"$f":"IF(ISERROR(G35/E35),0,G35/E35)","v":0},{"$f":"IF(G35=0,F35,IF(ROUNDDOWN(E35/C35/(G35/(E35/2)),0)<(E35/C35),ROUNDDOWN(E35/C35/(G35/(E35/2)),0),ROUNDDOWN(E35/C35,0)))","v":0},null,3.7,null,null,{"$f":"IF(L35=\"JA\",MIN(F35,I35),ROUNDDOWN(M35/K35,0))","v":0},null,{"$f":"IF(M35=0,0,O35/M35)","v":0},0,{"$f":"Berechnungstabellen!I61","v":0}]
["Geprüfte Maßangaben:"]
[]
["Anmerkungen / best. ANG´s"]
[]
["Stallblatt",{"$f":"B21+1","v":3},"Stallname (bei mehreren Ställen: Je Stall ist das Formular jew. separat auszufüllen):",null,null,null,null,null,null,null,null,null,null,null,"Baujahr:"]
[null,null,"Stallgebäude",null,null,null,null,null,null,null,"Außenfläche (muss planbefestigt sein!)"]
[null,null,null,null,"Stallfläche",null,null,"Stallboden"]
["Tiergruppe",null,"benötigte \nm²/Tier","Box-nummer(n) lt. Stall-plan","Stall-fläche\nm² ","max. Tierzahl \nStallfläche","davon Spalten-boden / perforiert\nm²","in %","max. Tierzahl \nStall-boden","Belegung\naktuell","benötigte \nm²/Tier","Zugang Weide möglich (Mai-Okt.)","\nAußen-fläche\nm² ","max. Tierzahl \nAußen-flächen","Über-dachung m2","Über-dachung %","max. Tierzahl \nÜber-dachung","Max. Tier-zahl"]
["Schafe",null,null,null,null,null,"max. ",0.5,null,null,null,null,null,null,"max.",0.5]
["Lamm (< 1J)",null,0.35,null,null,{"$f":"ROUNDDOWN(E45/C45,0)","v":0},null,{"$f":"IF(ISERROR(G45/E45),0,G45/E45)","v":0},{"$f":"IF(G45=0,F45,IF(ROUNDDOWN(E45/C45/(G45/(E45/2)),0)<(E45/C45),ROUNDDOWN(E45/C45/(G45/(E45/2)),0),ROUNDDOWN(E45/C45,0)))","v":0},null,0.5,null,null,{"$f":"IF(L45=\"JA\",MIN(F45,I45),ROUNDDOWN(M45/K45,0))","v":0},null,{"$f":"IF(M45=0,0,O45/M45)","v":0},{"$f":"IF(L45=\"JA\",N45,IF(M45=0,0,IF(ROUNDDOWN((N45+(N45*-((O45-(M45*P$6))/(M45-(M45*P$6))))),0)>N45,N45,(ROUNDDOWN((N45+(N45*-((O45-(M45*P$6))/(M45-(M45*P$6))))),0)))))","v":0},{"$f":"Berechnungstabellen!I63","v":0}]
["Mutter-/ Milchschaf",null,1.5,null,null,{"$f":"ROUNDDOWN(E46/C46,0)","v":0},null,{"$f":"IF(ISERROR(G46/E46),0,G46/E46)","v":0},{"$f":"IF(G46=0,F46,IF(ROUNDDOWN(E46/C46/(G46/(E46/2)),0)<(E46/C46),ROUNDDOWN(E46/C46/(G46/(E46/2)),0),ROUNDDOWN(E46/C46,0)))","v":0},null,2.5,null,null,{"$f":"IF(L46=\"JA\",MIN(F46,I46),ROUNDDOWN(M46/K46,0))","v":0},null,{"$f":"IF(M46=0,0,O46/M46)","v":0},{"$f":"IF(L46=\"JA\",N46,IF(M46=0,0,IF(ROUNDDOWN((N46+(N46*-((O46-(M46*P$6))/(M46-(M46*P$6))))),0)>N46,N46,(ROUNDDOWN((N46+(N46*-((O46-(M46*P$6))/(M46-(M46*P$6))))),0)))))","v":0},{"$f":"Berechnungstabellen!I64","v":0}]
["Ziegen"]
["Ziegenlamm (< 1J)",null,0.35,null,null,{"$f":"ROUNDDOWN(E48/C48,0)","v":0},null,{"$f":"IF(ISERROR(G48/E48),0,G48/E48)","v":0},{"$f":"IF(G48=0,F48,IF(ROUNDDOWN(E48/C48/(G48/(E48/2)),0)<(E48/C48),ROUNDDOWN(E48/C48/(G48/(E48/2)),0),ROUNDDOWN(E48/C48,0)))","v":0},null,0.5,null,null,{"$f":"IF(L48=\"JA\",MIN(F48,I48),ROUNDDOWN(M48/K48,0))","v":0},null,{"$f":"IF(M48=0,0,O48/M48)","v":0},{"$f":"IF(L48=\"JA\",N48,IF(M48=0,0,IF(ROUNDDOWN((N48+(N48*-((O48-(M48*P$6))/(M48-(M48*P$6))))),0)>N48,N48,(ROUNDDOWN((N48+(N48*-((O48-(M48*P$6))/(M48-(M48*P$6))))),0)))))","v":0},{"$f":"Berechnungstabellen!I66","v":0}]
["Ziegen",null,1.5,null,null,{"$f":"ROUNDDOWN(E49/C49,0)","v":0},null,{"$f":"IF(ISERROR(G49/E49),0,G49/E49)","v":0},{"$f":"IF(G49=0,F49,IF(ROUNDDOWN(E49/C49/(G49/(E49/2)),0)<(E49/C49),ROUNDDOWN(E49/C49/(G49/(E49/2)),0),ROUNDDOWN(E49/C49,0)))","v":0},null,2.5,null,null,{"$f":"IF(L49=\"JA\",MIN(F49,I49),ROUNDDOWN(M49/K49,0))","v":0},null,{"$f":"IF(M49=0,0,O49/M49)","v":0},0,{"$f":"Berechnungstabellen!I67","v":0}]
["Pferde",null,"1m²/100kg",null,null,null,null,null,null,null,"0,75m²/100kg"]
["Pferde < 100 kg ",null,1.5,null,null,{"$f":"ROUNDDOWN(E51/C51,0)","v":0},null,{"$f":"IF(ISERROR(G51/E51),0,G51/E51)","v":0},{"$f":"IF(G51=0,F51,IF(ROUNDDOWN(E51/C51/(G51/(E51/2)),0)<(E51/C51),ROUNDDOWN(E51/C51/(G51/(E51/2)),0),ROUNDDOWN(E51/C51,0)))","v":0},null,1.1000000000000001,null,null,{"$f":"IF(L51=\"JA\",MIN(F51,I51),ROUNDDOWN(M51/K51,0))","v":0},null,{"$f":"IF(M51=0,0,O51/M51)","v":0},{"$f":"IF(L51=\"JA\",N51,IF(M51=0,0,IF(ROUNDDOWN((N51+(N51*-((O51-(M51*P$6))/(M51-(M51*P$6))))),0)>N51,N51,(ROUNDDOWN((N51+(N51*-((O51-(M51*P$6))/(M51-(M51*P$6))))),0)))))","v":0},{"$f":"Berechnungstabellen!I69","v":0}]
["Pferde bis 200 kg ",null,2.5,null,null,{"$f":"ROUNDDOWN(E52/C52,0)","v":0},null,{"$f":"IF(ISERROR(G52/E52),0,G52/E52)","v":0},{"$f":"IF(G52=0,F52,IF(ROUNDDOWN(E52/C52/(G52/(E52/2)),0)<(E52/C52),ROUNDDOWN(E52/C52/(G52/(E52/2)),0),ROUNDDOWN(E52/C52,0)))","v":0},null,1.9,null,null,{"$f":"IF(L52=\"JA\",MIN(F52,I52),ROUNDDOWN(M52/K52,0))","v":0},null,{"$f":"IF(M52=0,0,O52/M52)","v":0},0,{"$f":"Berechnungstabellen!I70","v":0}]
["Pferde bis 350 kg ",null,4,null,null,0,null,0,0,null,3,null,null,0,null,0,0,{"$f":"Berechnungstabellen!I71","v":0}]
["Pferde über 350 kg ",null,5,null,null,{"$f":"ROUNDDOWN(E54/C54,0)","v":0},null,{"$f":"IF(ISERROR(G54/E54),0,G54/E54)","v":0},{"$f":"IF(G54=0,F54,IF(ROUNDDOWN(E54/C54/(G54/(E54/2)),0)<(E54/C54),ROUNDDOWN(E54/C54/(G54/(E54/2)),0),ROUNDDOWN(E54/C54,0)))","v":0},null,3.7,null,null,{"$f":"IF(L54=\"JA\",MIN(F54,I54),ROUNDDOWN(M54/K54,0))","v":0},null,{"$f":"IF(M54=0,0,O54/M54)","v":0},0,{"$f":"Berechnungstabellen!I72","v":0}]
["Geprüfte Maßangaben:"]
[]
["Anmerkungen / best. ANG´s"]
[]
["Stallblatt",{"$f":"B40+1","v":4},"Stallname (bei mehreren Ställen: Je Stall ist das Formular jew. separat auszufüllen):",null,null,null,null,null,null,null,null,null,null,null,"Baujahr:"]
[null,null,"Stallgebäude",null,null,null,null,null,null,null,"Außenfläche (muss planbefestigt sein!)"]
[null,null,null,null,"Stallfläche",null,null,"Stallboden"]
["Tiergruppe",null,"benötigte \nm²/Tier","Box-nummer(n) lt. Stall-plan","Stall-fläche\nm² ","max. Tierzahl \nStallfläche","davon Spalten-boden / perforiert\nm²","in %","max. Tierzahl \nStall-boden","Belegung\naktuell","benötigte \nm²/Tier","Zugang Weide möglich (Mai-Okt.)","\nAußen-fläche\nm² ","max. Tierzahl \nAußen-flächen","Über-dachung m2","Über-dachung %","max. Tierzahl \nÜber-dachung","Max. Tier-zahl"]
["Schafe",null,null,null,null,null,"max. ",0.5,null,null,null,null,null,null,"max.",0.5]
["Lamm (< 1J)",null,0.35,null,null,{"$f":"ROUNDDOWN(E64/C64,0)","v":0},null,{"$f":"IF(ISERROR(G64/E64),0,G64/E64)","v":0},{"$f":"IF(G64=0,F64,IF(ROUNDDOWN(E64/C64/(G64/(E64/2)),0)<(E64/C64),ROUNDDOWN(E64/C64/(G64/(E64/2)),0),ROUNDDOWN(E64/C64,0)))","v":0},null,0.5,null,null,{"$f":"IF(L64=\"JA\",MIN(F64,I64),ROUNDDOWN(M64/K64,0))","v":0},null,{"$f":"IF(M64=0,0,O64/M64)","v":0},{"$f":"IF(L64=\"JA\",N64,IF(M64=0,0,IF(ROUNDDOWN((N64+(N64*-((O64-(M64*P$6))/(M64-(M64*P$6))))),0)>N64,N64,(ROUNDDOWN((N64+(N64*-((O64-(M64*P$6))/(M64-(M64*P$6))))),0)))))","v":0},{"$f":"Berechnungstabellen!I74","v":0}]
["Mutter-/ Milchschaf",null,1.5,null,null,{"$f":"ROUNDDOWN(E65/C65,0)","v":0},null,{"$f":"IF(ISERROR(G65/E65),0,G65/E65)","v":0},{"$f":"IF(G65=0,F65,IF(ROUNDDOWN(E65/C65/(G65/(E65/2)),0)<(E65/C65),ROUNDDOWN(E65/C65/(G65/(E65/2)),0),ROUNDDOWN(E65/C65,0)))","v":0},null,2.5,null,null,{"$f":"IF(L65=\"JA\",MIN(F65,I65),ROUNDDOWN(M65/K65,0))","v":0},null,{"$f":"IF(M65=0,0,O65/M65)","v":0},{"$f":"IF(L65=\"JA\",N65,IF(M65=0,0,IF(ROUNDDOWN((N65+(N65*-((O65-(M65*P$6))/(M65-(M65*P$6))))),0)>N65,N65,(ROUNDDOWN((N65+(N65*-((O65-(M65*P$6))/(M65-(M65*P$6))))),0)))))","v":0},{"$f":"Berechnungstabellen!I75","v":0}]
["Ziegen"]
["Ziegenlamm (< 1J)",null,0.35,null,null,{"$f":"ROUNDDOWN(E67/C67,0)","v":0},null,{"$f":"IF(ISERROR(G67/E67),0,G67/E67)","v":0},{"$f":"IF(G67=0,F67,IF(ROUNDDOWN(E67/C67/(G67/(E67/2)),0)<(E67/C67),ROUNDDOWN(E67/C67/(G67/(E67/2)),0),ROUNDDOWN(E67/C67,0)))","v":0},null,0.5,null,null,{"$f":"IF(L67=\"JA\",MIN(F67,I67),ROUNDDOWN(M67/K67,0))","v":0},null,{"$f":"IF(M67=0,0,O67/M67)","v":0},{"$f":"IF(L67=\"JA\",N67,IF(M67=0,0,IF(ROUNDDOWN((N67+(N67*-((O67-(M67*P$6))/(M67-(M67*P$6))))),0)>N67,N67,(ROUNDDOWN((N67+(N67*-((O67-(M67*P$6))/(M67-(M67*P$6))))),0)))))","v":0},{"$f":"Berechnungstabellen!I77","v":0}]
["Ziegen",null,1.5,null,null,{"$f":"ROUNDDOWN(E68/C68,0)","v":0},null,{"$f":"IF(ISERROR(G68/E68),0,G68/E68)","v":0},{"$f":"IF(G68=0,F68,IF(ROUNDDOWN(E68/C68/(G68/(E68/2)),0)<(E68/C68),ROUNDDOWN(E68/C68/(G68/(E68/2)),0),ROUNDDOWN(E68/C68,0)))","v":0},null,2.5,null,null,{"$f":"IF(L68=\"JA\",MIN(F68,I68),ROUNDDOWN(M68/K68,0))","v":0},null,{"$f":"IF(M68=0,0,O68/M68)","v":0},0,{"$f":"Berechnungstabellen!I78","v":0}]
["Pferde",null,"1m²/100kg",null,null,null,null,null,null,null,"0,75m²/100kg"]
["Pferde < 100 kg ",null,1.5,null,null,{"$f":"ROUNDDOWN(E70/C70,0)","v":0},null,{"$f":"IF(ISERROR(G70/E70),0,G70/E70)","v":0},{"$f":"IF(G70=0,F70,IF(ROUNDDOWN(E70/C70/(G70/(E70/2)),0)<(E70/C70),ROUNDDOWN(E70/C70/(G70/(E70/2)),0),ROUNDDOWN(E70/C70,0)))","v":0},null,1.1000000000000001,null,null,{"$f":"IF(L70=\"JA\",MIN(F70,I70),ROUNDDOWN(M70/K70,0))","v":0},null,{"$f":"IF(M70=0,0,O70/M70)","v":0},{"$f":"IF(L70=\"JA\",N70,IF(M70=0,0,IF(ROUNDDOWN((N70+(N70*-((O70-(M70*P$6))/(M70-(M70*P$6))))),0)>N70,N70,(ROUNDDOWN((N70+(N70*-((O70-(M70*P$6))/(M70-(M70*P$6))))),0)))))","v":0},{"$f":"Berechnungstabellen!I80","v":0}]
["Pferde bis 200 kg ",null,2.5,null,null,{"$f":"ROUNDDOWN(E71/C71,0)","v":0},null,{"$f":"IF(ISERROR(G71/E71),0,G71/E71)","v":0},{"$f":"IF(G71=0,F71,IF(ROUNDDOWN(E71/C71/(G71/(E71/2)),0)<(E71/C71),ROUNDDOWN(E71/C71/(G71/(E71/2)),0),ROUNDDOWN(E71/C71,0)))","v":0},null,1.9,null,null,{"$f":"IF(L71=\"JA\",MIN(F71,I71),ROUNDDOWN(M71/K71,0))","v":0},null,{"$f":"IF(M71=0,0,O71/M71)","v":0},0,{"$f":"Berechnungstabellen!I81","v":0}]
["Pferde bis 350 kg ",null,4,null,null,0,null,0,0,null,3,null,null,0,null,0,0,{"$f":"Berechnungstabellen!I82","v":0}]
["Pferde über 350 kg ",null,5,null,null,{"$f":"ROUNDDOWN(E73/C73,0)","v":0},null,{"$f":"IF(ISERROR(G73/E73),0,G73/E73)","v":0},{"$f":"IF(G73=0,F73,IF(ROUNDDOWN(E73/C73/(G73/(E73/2)),0)<(E73/C73),ROUNDDOWN(E73/C73/(G73/(E73/2)),0),ROUNDDOWN(E73/C73,0)))","v":0},null,3.7,null,null,{"$f":"IF(L73=\"JA\",MIN(F73,I73),ROUNDDOWN(M73/K73,0))","v":0},null,{"$f":"IF(M73=0,0,O73/M73)","v":0},0,{"$f":"Berechnungstabellen!I83","v":0}]
["Geprüfte Maßangaben:"]
[]
["Anmerkungen / best. ANG´s"]

{"sheet":"Schweine","index":4,"n_rows":90,"n_cols":22,"rows_kept":90,"cut":false,"hidden":false,"merged":[[15,2,15,17],[55,11,55,13],[37,11,37,13],[19,11,19,13],[1,11,1,13],[17,2,17,17],[87,2,87,17],[73,11,73,13],[69,2,69,17],[51,2,51,17],[33,2,33,17],[35,2,35,17],[53,2,53,17],[71,2,71,17],[14,0,14,1],[6,0,6,1],[7,0,7,1],[8,0,8,1],[4,0,4,1],[5,0,5,1],[9,0,9,1],[10,0,10,1],[11,0,11,1],[12,0,12,1],[13,0,13,1],[22,0,22,1],[23,0,23,1],[24,0,24,1],[25,0,25,1],[26,0,26,1],[27,0,27,1],[28,0,28,1],[29,0,29,1],[30,0,30,1],[31,0,31,1],[32,0,32,1],[40,0,40,1],[41,0,41,1],[42,0,42,1],[43,0,43,1],[44,0,44,1],[45,0,45,1],[46,0,46,1],[47,0,47,1],[48,0,48,1],[49,0,49,1],[50,0,50,1],[58,0,58,1],[59,0,59,1],[60,0,60,1],[77,0,77,1],[61,0,61,1],[62,0,62,1],[63,0,63,1],[64,0,64,1],[65,0,65,1],[89,2,89,17],[2,19,3,21],[4,19,4,21],[83,0,83,1],[84,0,84,1],[85,0,85,1],[86,0,86,1],[78,0,78,1],[79,0,79,1],[80,0,80,1],[81,0,81,1],[82,0,82,1],[66,0,66,1],[67,0,67,1],[68,0,68,1],[76,0,76,1]]}
["Ermittlung der maximalen Tierzahl, die gem. EU VO 2018/848 sowie 2020-464 Anhang I je Stallblatt gehalten werden darf",null,null,null,null,null,null,null,null,null,null,null,null,null,null,null,null,"Schweine"]
["Stallblatt",1,"Stallname (bei mehreren Ställen: Je Stall ist das Formular jew. separat auszufüllen):",null,null,null,null,null,null,null,null,null,null,null,null,"Baujahr:"]
[null,null,"Stallgebäude",null,null,null,null,null,null,null,"Außenfläche (muss planbefestigt sein!)",null,null,null,null,null,null,null,null,"Zum Abgleich Eingabe Ecert mit Bestandsbuch Tagesbestand"]
[null,null,null,null,"Stallfläche",null,null,"Stallboden",null,null,null,null,"Außenfläche",null,null,"Überdachung"]
["Tiergruppe",null,"benötigte \nm²/Tier","Box-nummer(n) lt. Stall-plan","Stall-fläche\nm² ","max. Tierzahl \nStallfläche","davon Spalten-boden / per-foriert m²","in %","max. Tierzahl \nStall-boden","Belegung\naktuell","benötigte \nm²/Tier","Zugang Weide möglich (Mai-Okt.)","\nAußen-fläche\nm² ","max. Tierzahl \nAußen-flächen","Über-dachung m2","Über-dachung %","max. Tierzahl \nÜber-dachung","Max. Tier-zahl",null,"Max. Tierzahl ges. über alle Ställe"]
[null,null,null,null,null,null,"max. ",0.5,null,null,null,null,null,null,"max.",0.5,null,null,null,null,"Max Tierzahl ges.","Gehaltene Tiere"]
["Führende Sau m. Ferkel <40 T.",null,7.5,null,null,{"$f":"ROUNDDOWN(E7/C7,0)","v":0},null,{"$f":"IF(ISERROR(G7/E7),0,G7/E7)","v":0},{"$f":"IF(G7=0,F7,IF(ROUNDDOWN(E7/C7/(G7/(E7/2)),0)<(E7/C7),ROUNDDOWN(E7/C7/(G7/(E7/2)),0),ROUNDDOWN(E7/C7,0)))","v":0},null,2.5,null,null,{"$f":"IF(L7=\"JA\",MIN(F7,I7),ROUNDDOWN(M7/K7,0))","v":0},null,{"$f":"IF(M7=0,0,O7/M7)","v":0},{"$f":"IF(L7=\"JA\",N7,IF(M7=0,0,IF(ROUNDDOWN((N7+(N7*-((O7-(M7*P$6))/(M7-(M7*P$6))))),0)>N7,N7,(ROUNDDOWN((N7+(N7*-((O7-(M7*P$6))/(M7-(M7*P$6))))),0)))))","v":0},{"$f":"Berechnungstabellen!I146","v":0},null,{"$f":"A7","v":"Führende Sau m. Ferkel <40 T."},{"$f":"Berechnungstabellen!J146","v":0},{"$f":"J7+J25+J43+J61+J79","v":0}]
["Ferkel  >40Tage, < 30 kg",null,0.6,null,null,{"$f":"ROUNDDOWN(E8/C8,0)","v":0},null,{"$f":"IF(ISERROR(G8/E8),0,G8/E8)","v":0},{"$f":"IF(G8=0,F8,IF(ROUNDDOWN(E8/C8/(G8/(E8/2)),0)<(E8/C8),ROUNDDOWN(E8/C8/(G8/(E8/2)),0),ROUNDDOWN(E8/C8,0)))","v":0},null,0.4,null,null,{"$f":"IF(L8=\"JA\",MIN(F8,I8),ROUNDDOWN(M8/K8,0))","v":0},null,{"$f":"IF(M8=0,0,O8/M8)","v":0},{"$f":"IF(L8=\"JA\",N8,IF(M8=0,0,IF(ROUNDDOWN((N8+(N8*-((O8-(M8*P$6))/(M8-(M8*P$6))))),0)>N8,N8,(ROUNDDOWN((N8+(N8*-((O8-(M8*P$6))/(M8-(M8*P$6))))),0)))))","v":0},{"$f":"Berechnungstabellen!I147","v":0},null,{"$f":"A8","v":"Ferkel  >40Tage, < 30 kg"},{"$f":"Berechnungstabellen!J147","v":0},{"$f":"J8+J26+J44+J62+J80","v":0}]
["Mastschweine bis 50 kg",null,0.8,null,null,0,null,0,{"$f":"IF(G9=0,F9,IF(ROUNDDOWN(E9/C9/(G9/(E9/2)),0)<(E9/C9),ROUNDDOWN(E9/C9/(G9/(E9/2)),0),ROUNDDOWN(E9/C9,0)))","v":0},null,0.6,null,null,0,null,0,0,{"$f":"Berechnungstabellen!I148","v":0},null,{"$f":"A9","v":"Mastschweine bis 50 kg"},{"$f":"Berechnungstabellen!J148","v":0},0]
["Mastschweine bis 85 kg",null,1.1000000000000001,null,null,0,null,0,0,null,0.8,null,null,0,null,0,0,{"$f":"Berechnungstabellen!I149","v":0},null,{"$f":"A10","v":"Mastschweine bis 85 kg"},{"$f":"Berechnungstabellen!J149","v":0},0]
["Mastschweine bis 110 kg",null,1.3,null,null,0,null,0,0,null,1,null,null,0,null,0,0,{"$f":"Berechnungstabellen!I150","v":0},null,"Mastschweine bis 110 kg",{"$f":"Berechnungstabellen!J150","v":0},0]
["Mastschweine über 110 kg",null,1.5,null,null,0,null,0,0,null,1.2,null,null,0,null,0,0,{"$f":"Berechnungstabellen!I151","v":0},null,"Mastschweine über 110 kg",{"$f":"Berechnungstabellen!J151","v":0},0]
["Zuchtsauen",null,2.5,null,null,0,null,0,0,null,1.9,null,null,0,null,0,0,{"$f":"Berechnungstabellen!I152","v":0},null,"Zuchtsauen",{"$f":"Berechnungstabellen!J152","v":0},0]
["Eber",null,6,null,null,0,null,0,0,null,8,null,null,0,null,0,0,{"$f":"Berechnungstabellen!I153","v":0},null,"Eber",{"$f":"Berechnungstabellen!J153","v":0},0]
["Eber (natürl. Paarung in Buchten)",null,10,null,null,0,null,0,0,null,8,null,null,0,null,0,0,{"$f":"Berechnungstabellen!I154","v":0},null,"Eber (natürl. Paarung in Buchten)",{"$f":"Berechnungstabellen!J154","v":0},0]
["Geprüfte Maßangaben:"]
[]
["Anmerkungen / ANG´s"]
[]
["Stallblatt",{"$f":"B2+1","v":2},"Stallname (bei mehreren Ställen: Je Stall ist das Formular jew. separat auszufüllen):",null,null,null,null,null,null,null,null,null,null,null,null,"Baujahr:"]
[null,null,"Stallgebäude",null,null,null,null,null,null,null,"Außenfläche (muss planbefestigt sein!)"]
[null,null,null,null,"Stallfläche",null,null,"Stallboden",null,null,null,null,"Außenfläche",null,null,"Überdachung"]
["Tiergruppe",null,"benötigte \nm²/Tier","Box-nummer(n) lt. Stall-plan","Stall-fläche\nm² ","max. Tierzahl \nStallfläche","davon Spalten-boden / per-foriert m²","in %","max. Tierzahl \nStall-boden","Belegung\naktuell","benötigte \nm²/Tier","Zugang Weide möglich (Mai-Okt.)","\nAußen-fläche\nm² ","max. Tierzahl \nAußen-flächen","Über-dachung m2","Über-dachung %","max. Tierzahl \nÜber-dachung","Max. Tier-zahl"]
[null,null,null,null,null,null,"max. ",0.5,null,null,null,null,null,null,"max.",0.5]
["Führende Sau m. Ferkel <40 T.",null,7.5,null,null,{"$f":"ROUNDDOWN(E25/C25,0)","v":0},null,{"$f":"IF(ISERROR(G25/E25),0,G25/E25)","v":0},{"$f":"IF(G25=0,F25,IF(ROUNDDOWN(E25/C25/(G25/(E25/2)),0)<(E25/C25),ROUNDDOWN(E25/C25/(G25/(E25/2)),0),ROUNDDOWN(E25/C25,0)))","v":0},null,2.5,null,null,{"$f":"IF(L25=\"JA\",MIN(F25,I25),ROUNDDOWN(M25/K25,0))","v":0},null,{"$f":"IF(M25=0,0,O25/M25)","v":0},{"$f":"IF(L25=\"JA\",N25,IF(M25=0,0,IF(ROUNDDOWN((N25+(N25*-((O25-(M25*P$6))/(M25-(M25*P$6))))),0)>N25,N25,(ROUNDDOWN((N25+(N25*-((O25-(M25*P$6))/(M25-(M25*P$6))))),0)))))","v":0},{"$f":"Berechnungstabellen!I156","v":0}]
["Ferkel  >40Tage, < 30 kg",null,0.6,null,null,{"$f":"ROUNDDOWN(E26/C26,0)","v":0},null,{"$f":"IF(ISERROR(G26/E26),0,G26/E26)","v":0},{"$f":"IF(G26=0,F26,IF(ROUNDDOWN(E26/C26/(G26/(E26/2)),0)<(E26/C26),ROUNDDOWN(E26/C26/(G26/(E26/2)),0),ROUNDDOWN(E26/C26,0)))","v":0},null,0.4,null,null,{"$f":"IF(L26=\"JA\",MIN(F26,I26),ROUNDDOWN(M26/K26,0))","v":0},null,{"$f":"IF(M26=0,0,O26/M26)","v":0},{"$f":"IF(L26=\"JA\",N26,IF(M26=0,0,IF(ROUNDDOWN((N26+(N26*-((O26-(M26*P$6))/(M26-(M26*P$6))))),0)>N26,N26,(ROUNDDOWN((N26+(N26*-((O26-(M26*P$6))/(M26-(M26*P$6))))),0)))))","v":0},{"$f":"Berechnungstabellen!I157","v":0}]
["Mastschweine bis 50 kg",null,0.8,null,null,0,null,0,{"$f":"IF(G27=0,F27,IF(ROUNDDOWN(E27/C27/(G27/(E27/2)),0)<(E27/C27),ROUNDDOWN(E27/C27/(G27/(E27/2)),0),ROUNDDOWN(E27/C27,0)))","v":0},null,0.6,null,null,0,null,0,0,{"$f":"Berechnungstabellen!I158","v":0}]
["Mastschweine bis 85 kg",null,1.1000000000000001,null,null,0,null,0,0,null,0.8,null,null,0,null,0,0,{"$f":"Berechnungstabellen!I159","v":0}]
["Mastschweine bis 110 kg",null,1.3,null,null,0,null,0,0,null,1,null,null,0,null,0,0,{"$f":"Berechnungstabellen!I160","v":0}]
["Mastschweine über 110 kg",null,1.5,null,null,0,null,0,0,null,1.2,null,null,0,null,0,0,{"$f":"Berechnungstabellen!I161","v":0}]
["Zuchtsauen",null,2.5,null,null,0,null,0,0,null,1.9,null,null,0,null,0,0,{"$f":"Berechnungstabellen!I162","v":0}]
["Eber",null,6,null,null,0,null,0,0,null,8,null,null,0,null,0,0,{"$f":"Berechnungstabellen!I163","v":0}]
["Eber (natürl. Paarung in Buchten)",null,10,null,null,0,null,0,0,null,8,null,null,0,null,0,0,{"$f":"Berechnungstabellen!I164","v":0}]
["Geprüfte Maßangaben:"]
[]
["Anmerkungen / ANG´s"]
[]
["Stallblatt",{"$f":"B20+1","v":3},"Stallname (bei mehreren Ställen: Je Stall ist das Formular jew. separat auszufüllen):",null,null,null,null,null,null,null,null,null,null,null,null,"Baujahr:"]
[null,null,"Stallgebäude",null,null,null,null,null,null,null,"Außenfläche (muss planbefestigt sein!)"]
[null,null,null,null,"Stallfläche",null,null,"Stallboden",null,null,null,null,"Außenfläche",null,null,"Überdachung"]
["Tiergruppe",null,"benötigte \nm²/Tier","Box-nummer(n) lt. Stall-plan","Stall-fläche\nm² ","max. Tierzahl \nStallfläche","davon Spalten-boden / per-foriert m²","in %","max. Tierzahl \nStall-boden","Belegung\naktuell","benötigte \nm²/Tier","Zugang Weide möglich (Mai-Okt.)","\nAußen-fläche\nm² ","max. Tierzahl \nAußen-flächen","Über-dachung m2","Über-dachung %","max. Tierzahl \nÜber-dachung","Max. Tier-zahl"]
[null,null,null,null,null,null,"max. ",0.5,null,null,null,null,null,null,"max.",0.5]
["Führende Sau m. Ferkel <40 T.",null,7.5,null,null,{"$f":"ROUNDDOWN(E43/C43,0)","v":0},null,{"$f":"IF(ISERROR(G43/E43),0,G43/E43)","v":0},{"$f":"IF(G43=0,F43,IF(ROUNDDOWN(E43/C43/(G43/(E43/2)),0)<(E43/C43),ROUNDDOWN(E43/C43/(G43/(E43/2)),0),ROUNDDOWN(E43/C43,0)))","v":0},null,2.5,null,null,{"$f":"IF(L43=\"JA\",MIN(F43,I43),ROUNDDOWN(M43/K43,0))","v":0},null,{"$f":"IF(M43=0,0,O43/M43)","v":0},{"$f":"IF(L43=\"JA\",N43,IF(M43=0,0,IF(ROUNDDOWN((N43+(N43*-((O43-(M43*P$6))/(M43-(M43*P$6))))),0)>N43,N43,(ROUNDDOWN((N43+(N43*-((O43-(M43*P$6))/(M43-(M43*P$6))))),0)))))","v":0},{"$f":"Berechnungstabellen!I166","v":0}]
["Ferkel  >40Tage, < 30 kg",null,0.6,null,null,{"$f":"ROUNDDOWN(E44/C44,0)","v":0},null,{"$f":"IF(ISERROR(G44/E44),0,G44/E44)","v":0},{"$f":"IF(G44=0,F44,IF(ROUNDDOWN(E44/C44/(G44/(E44/2)),0)<(E44/C44),ROUNDDOWN(E44/C44/(G44/(E44/2)),0),ROUNDDOWN(E44/C44,0)))","v":0},null,0.4,null,null,{"$f":"IF(L44=\"JA\",MIN(F44,I44),ROUNDDOWN(M44/K44,0))","v":0},null,{"$f":"IF(M44=0,0,O44/M44)","v":0},{"$f":"IF(L44=\"JA\",N44,IF(M44=0,0,IF(ROUNDDOWN((N44+(N44*-((O44-(M44*P$6))/(M44-(M44*P$6))))),0)>N44,N44,(ROUNDDOWN((N44+(N44*-((O44-(M44*P$6))/(M44-(M44*P$6))))),0)))))","v":0},{"$f":"Berechnungstabellen!I167","v":0}]
["Mastschweine bis 50 kg",null,0.8,null,null,0,null,0,{"$f":"IF(G45=0,F45,IF(ROUNDDOWN(E45/C45/(G45/(E45/2)),0)<(E45/C45),ROUNDDOWN(E45/C45/(G45/(E45/2)),0),ROUNDDOWN(E45/C45,0)))","v":0},null,0.6,null,null,0,null,0,0,{"$f":"Berechnungstabellen!I168","v":0}]
["Mastschweine bis 85 kg",null,1.1000000000000001,null,null,0,null,0,0,null,0.8,null,null,0,null,0,0,{"$f":"Berechnungstabellen!I169","v":0}]
["Mastschweine bis 110 kg",null,1.3,null,null,0,null,0,0,null,1,null,null,0,null,0,0,{"$f":"Berechnungstabellen!I170","v":0}]
["Mastschweine über 110 kg",null,1.5,null,null,0,null,0,0,null,1.2,null,null,0,null,0,0,{"$f":"Berechnungstabellen!I171","v":0}]
["Zuchtsauen",null,2.5,null,null,0,null,0,0,null,1.9,null,null,0,null,0,0,{"$f":"Berechnungstabellen!I172","v":0}]
["Eber",null,6,null,null,0,null,0,0,null,8,null,null,0,null,0,0,{"$f":"Berechnungstabellen!I173","v":0}]
["Eber (natürl. Paarung in Buchten)",null,10,null,null,0,null,0,0,null,8,null,null,0,null,0,0,{"$f":"Berechnungstabellen!I174","v":0}]
["Geprüfte Maßangaben:"]
[]
["Anmerkungen / ANG´s"]
[]
["Stallblatt",{"$f":"B38+1","v":4},"Stallname (bei mehreren Ställen: Je Stall ist das Formular jew. separat auszufüllen):",null,null,null,null,null,null,null,null,null,null,null,null,"Baujahr:"]
[null,null,"Stallgebäude",null,null,null,null,null,null,null,"Außenfläche (muss planbefestigt sein!)"]
[null,null,null,null,"Stallfläche",null,null,"Stallboden",null,null,null,null,"Außenfläche",null,null,"Überdachung"]
["Tiergruppe",null,"benötigte \nm²/Tier","Box-nummer(n) lt. Stall-plan","Stall-fläche\nm² ","max. Tierzahl \nStallfläche","davon Spalten-boden / per-foriert m²","in %","max. Tierzahl \nStall-boden","Belegung\naktuell","benötigte \nm²/Tier","Zugang Weide möglich (Mai-Okt.)","\nAußen-fläche\nm² ","max. Tierzahl \nAußen-flächen","Über-dachung m2","Über-dachung %","max. Tierzahl \nÜber-dachung","Max. Tier-zahl"]
[null,null,null,null,null,null,"max. ",0.5,null,null,null,null,null,null,"max.",0.5]
["Führende Sau m. Ferkel <40 T.",null,7.5,null,null,{"$f":"ROUNDDOWN(E61/C61,0)","v":0},null,{"$f":"IF(ISERROR(G61/E61),0,G61/E61)","v":0},{"$f":"IF(G61=0,F61,IF(ROUNDDOWN(E61/C61/(G61/(E61/2)),0)<(E61/C61),ROUNDDOWN(E61/C61/(G61/(E61/2)),0),ROUNDDOWN(E61/C61,0)))","v":0},null,2.5,null,null,{"$f":"IF(L61=\"JA\",MIN(F61,I61),ROUNDDOWN(M61/K61,0))","v":0},null,{"$f":"IF(M61=0,0,O61/M61)","v":0},{"$f":"IF(L61=\"JA\",N61,IF(M61=0,0,IF(ROUNDDOWN((N61+(N61*-((O61-(M61*P$6))/(M61-(M61*P$6))))),0)>N61,N61,(ROUNDDOWN((N61+(N61*-((O61-(M61*P$6))/(M61-(M61*P$6))))),0)))))","v":0},{"$f":"Berechnungstabellen!I176","v":0}]
["Ferkel  >40Tage, < 30 kg",null,0.6,null,null,{"$f":"ROUNDDOWN(E62/C62,0)","v":0},null,{"$f":"IF(ISERROR(G62/E62),0,G62/E62)","v":0},{"$f":"IF(G62=0,F62,IF(ROUNDDOWN(E62/C62/(G62/(E62/2)),0)<(E62/C62),ROUNDDOWN(E62/C62/(G62/(E62/2)),0),ROUNDDOWN(E62/C62,0)))","v":0},null,0.4,null,null,{"$f":"IF(L62=\"JA\",MIN(F62,I62),ROUNDDOWN(M62/K62,0))","v":0},null,{"$f":"IF(M62=0,0,O62/M62)","v":0},{"$f":"IF(L62=\"JA\",N62,IF(M62=0,0,IF(ROUNDDOWN((N62+(N62*-((O62-(M62*P$6))/(M62-(M62*P$6))))),0)>N62,N62,(ROUNDDOWN((N62+(N62*-((O62-(M62*P$6))/(M62-(M62*P$6))))),0)))))","v":0},{"$f":"Berechnungstabellen!I177","v":0}]
["Mastschweine bis 50 kg",null,0.8,null,null,0,null,0,{"$f":"IF(G63=0,F63,IF(ROUNDDOWN(E63/C63/(G63/(E63/2)),0)<(E63/C63),ROUNDDOWN(E63/C63/(G63/(E63/2)),0),ROUNDDOWN(E63/C63,0)))","v":0},null,0.6,null,null,0,null,0,0,{"$f":"Berechnungstabellen!I178","v":0}]
["Mastschweine bis 85 kg",null,1.1000000000000001,null,null,0,null,0,0,null,0.8,null,null,0,null,0,0,{"$f":"Berechnungstabellen!I179","v":0}]
["Mastschweine bis 110 kg",null,1.3,null,null,0,null,0,0,null,1,null,null,0,null,0,0,{"$f":"Berechnungstabellen!I180","v":0}]
["Mastschweine über 110 kg",null,1.5,null,null,0,null,0,0,null,1.2,null,null,0,null,0,0,{"$f":"Berechnungstabellen!I181","v":0}]
["Zuchtsauen",null,2.5,null,null,0,null,0,0,null,1.9,null,null,0,null,0,0,{"$f":"Berechnungstabellen!I182","v":0}]
["Eber",null,6,null,null,0,null,0,0,null,8,null,null,0,null,0,0,{"$f":"Berechnungstabellen!I183","v":0}]
["Eber (natürl. Paarung in Buchten)",null,10,null,null,0,null,0,0,null,8,null,null,0,null,0,0,{"$f":"Berechnungstabellen!I184","v":0}]
["Geprüfte Maßangaben:"]
[]
["Anmerkungen / ANG´s"]
[]
["Stallblatt",{"$f":"B56+1","v":5},"Stallname (bei mehreren Ställen: Je Stall ist das Formular jew. separat auszufüllen):",null,null,null,null,null,null,null,null,null,null,null,null,"Baujahr:"]
[null,null,"Stallgebäude",null,null,null,null,null,null,null,"Außenfläche (muss planbefestigt sein!)"]
[null,null,null,null,"Stallfläche",null,null,"Stallboden",null,null,null,null,"Außenfläche",null,null,"Überdachung"]
["Tiergruppe",null,"benötigte \nm²/Tier","Box-nummer(n) lt. Stall-plan","Stall-fläche\nm² ","max. Tierzahl \nStallfläche","davon Spalten-boden / per-foriert m²","in %","max. Tierzahl \nStall-boden","Belegung\naktuell","benötigte \nm²/Tier","Zugang Weide möglich (Mai-Okt.)","\nAußen-fläche\nm² ","max. Tierzahl \nAußen-flächen","Über-dachung m2","Über-dachung %","max. Tierzahl \nÜber-dachung","Max. Tier-zahl"]
[null,null,null,null,null,null,"max. ",0.5,null,null,null,null,null,null,"max.",0.5]
["Führende Sau m. Ferkel <40 T.",null,7.5,null,null,{"$f":"ROUNDDOWN(E79/C79,0)","v":0},null,{"$f":"IF(ISERROR(G79/E79),0,G79/E79)","v":0},{"$f":"IF(G79=0,F79,IF(ROUNDDOWN(E79/C79/(G79/(E79/2)),0)<(E79/C79),ROUNDDOWN(E79/C79/(G79/(E79/2)),0),ROUNDDOWN(E79/C79,0)))","v":0},null,2.5,null,null,{"$f":"IF(L79=\"JA\",MIN(F79,I79),ROUNDDOWN(M79/K79,0))","v":0},null,{"$f":"IF(M79=0,0,O79/M79)","v":0},{"$f":"IF(L79=\"JA\",N79,IF(M79=0,0,IF(ROUNDDOWN((N79+(N79*-((O79-(M79*P$6))/(M79-(M79*P$6))))),0)>N79,N79,(ROUNDDOWN((N79+(N79*-((O79-(M79*P$6))/(M79-(M79*P$6))))),0)))))","v":0},{"$f":"Berechnungstabellen!I186","v":0}]
["Ferkel  >40Tage, < 30 kg",null,0.6,null,null,{"$f":"ROUNDDOWN(E80/C80,0)","v":0},null,{"$f":"IF(ISERROR(G80/E80),0,G80/E80)","v":0},{"$f":"IF(G80=0,F80,IF(ROUNDDOWN(E80/C80/(G80/(E80/2)),0)<(E80/C80),ROUNDDOWN(E80/C80/(G80/(E80/2)),0),ROUNDDOWN(E80/C80,0)))","v":0},null,0.4,null,null,{"$f":"IF(L80=\"JA\",MIN(F80,I80),ROUNDDOWN(M80/K80,0))","v":0},null,{"$f":"IF(M80=0,0,O80/M80)","v":0},{"$f":"IF(L80=\"JA\",N80,IF(M80=0,0,IF(ROUNDDOWN((N80+(N80*-((O80-(M80*P$6))/(M80-(M80*P$6))))),0)>N80,N80,(ROUNDDOWN((N80+(N80*-((O80-(M80*P$6))/(M80-(M80*P$6))))),0)))))","v":0},{"$f":"Berechnungstabellen!I187","v":0}]
["Mastschweine bis 50 kg",null,0.8,null,null,0,null,0,{"$f":"IF(G81=0,F81,IF(ROUNDDOWN(E81/C81/(G81/(E81/2)),0)<(E81/C81),ROUNDDOWN(E81/C81/(G81/(E81/2)),0),ROUNDDOWN(E81/C81,0)))","v":0},null,0.6,null,null,0,null,0,0,{"$f":"Berechnungstabellen!I188","v":0}]
["Mastschweine bis 85 kg",null,1.1000000000000001,null,null,0,null,0,0,null,0.8,null,null,0,null,0,0,{"$f":"Berechnungstabellen!I189","v":0}]
["Mastschweine bis 110 kg",null,1.3,null,null,0,null,0,0,null,1,null,null,0,null,0,0,{"$f":"Berechnungstabellen!I190","v":0}]
["Mastschweine über 110 kg",null,1.5,null,null,0,null,0,0,null,1.2,null,null,0,null,0,0,{"$f":"Berechnungstabellen!I191","v":0}]
["Zuchtsauen",null,2.5,null,null,0,null,0,0,null,1.9,null,null,0,null,0,0,{"$f":"Berechnungstabellen!I192","v":0}]
["Eber",null,6,null,null,0,null,0,0,null,8,null,null,0,null,0,0,{"$f":"Berechnungstabellen!I193","v":0}]
["Eber (natürl. Paarung in Buchten)",null,10,null,null,0,null,0,0,null,8,null,null,0,null,0,0,{"$f":"Berechnungstabellen!I194","v":0}]
["Geprüfte Maßangaben:"]
[]
["Anmerkungen / ANG´s"]

{"sheet":"Kaninchen","index":5,"n_rows":96,"n_cols":22,"rows_kept":96,"cut":false,"hidden":false,"merged":[[93,2,93,16],[5,18,5,19],[6,18,6,19],[7,18,7,19],[8,18,8,19],[9,18,9,19],[10,18,10,19],[11,18,11,19],[61,2,61,16],[65,10,65,11],[45,2,45,16],[49,10,49,11],[29,2,29,16],[33,10,33,11],[63,2,63,16],[91,0,91,1],[74,0,74,1],[75,0,75,1],[77,2,77,16],[81,10,81,11],[84,0,84,1],[85,0,85,1],[86,0,86,1],[87,0,87,1],[88,0,88,1],[89,0,89,1],[90,0,90,1],[79,2,79,16],[73,0,73,1],[56,0,56,1],[57,0,57,1],[58,0,58,1],[59,0,59,1],[68,0,68,1],[69,0,69,1],[70,0,70,1],[71,0,71,1],[72,0,72,1],[26,0,26,1],[27,0,27,1],[54,0,54,1],[55,0,55,1],[38,0,38,1],[39,0,39,1],[40,0,40,1],[41,0,41,1],[42,0,42,1],[43,0,43,1],[52,0,52,1],[53,0,53,1],[21,0,21,1],[22,0,22,1],[23,0,23,1],[24,0,24,1],[25,0,25,1],[95,2,95,16],[8,0,8,1],[1,10,1,11],[4,0,4,1],[5,0,5,1],[6,0,6,1],[7,0,7,1],[9,0,9,1],[10,0,10,1],[11,0,11,1],[13,2,13,16],[17,10,17,11],[15,2,15,16],[36,0,36,1],[37,0,37,1],[20,0,20,1],[4,18,4,19],[1,18,2,21],[3,18,3,21],[31,2,31,16],[47,2,47,16]]}
["Ermittlung der maximalen Tierzahl, die gem. EU VO 2018/848 sowie 2020/464 Anhang I je Stallblatt gehalten werden darf",null,null,null,null,null,null,null,null,null,null,null,null,null,null,null,"Kaninchen"]
["Stallblatt",1,"Stallname (bei mehreren Ställen: Je Stall ist das Formular jew. separat auszufüllen):",null,null,null,null,null,null,null,null,null,null,"Baujahr:",null,null,null,null,"Zum Abgleich Eingabe Ecert mit Bestandsregister"]
["Fester Stall",null,"Stallgebäude",null,null,null,null,null,null,null,"Außenfläche (muss planbefestigt sein!)"]
["Mobiler Stall",null,null,null,"Stallfläche",null,null,"Stallboden",null,null,null,null,null,"Überdachung max.",0.5,null,null,null,"Max. Tierzahl ges. über alle Ställe"]
["Tiergruppe",null,"benötigte \nm²/Tier","Stall- /Box-nummer(n) lt. Stall-plan","Stallfläche\nm² ","max. Tierzahl \nStallfläche","davon Spalten-boden / perforiert\nm²","in %","max. Tierzahl \nStallboden","Belegung\naktuell","benötigte \nm²/Tier","\nAußen-fläche\nm² ","max. Tierzahl \nAußenflächen","Über-dachung m2","Über-dachung %","max. Tierzahl \nÜber-dachung","Max. Tier-zahl",null,null,null,"Max Tierzahl ges.","Gehaltene Tiere"]
["Säugende Muttertiere mit Jungen bis zum Absetzen Mutter < 6kg",null,0.6,null,null,{"$f":"IF($B$3=\"Ja\",ROUNDDOWN(E6/C6,0),ROUNDDOWN(E6/C6,0))","v":0},null,{"$f":"IF(ISERROR(G6/E6),0,G6/E6)","v":0},{"$f":"IF(G6=0,F6,IF(ROUNDDOWN(E6/C6/(G6/(E6/2)),0)<(E6/C6),ROUNDDOWN(E6/C6/(G6/(E6/2)),0),ROUNDDOWN(E6/C6,0)))","v":0},null,2.5,null,{"$f":"ROUNDDOWN(L6/K6,0)","v":0},null,{"$f":"IF(L6=0,0,N6/L6)","v":0},{"$f":"IF(L6=0,0,IF(ROUNDDOWN((M6+(M6*-((N6-(L6*$O$4))/(L6-(L6*$O$4))))),0)>M6,M6,(ROUNDDOWN((M6+(M6*-((N6-(L6*$O$4))/(L6-(L6*$O$4))))),0))))","v":0},{"$f":"Berechnungstabellen!I87","v":0},null,"Säugende Muttertiere mit Jungen bis zum Absetzen Mutter < 6kg",null,{"$f":"Berechnungstabellen!J87","v":0},{"$f":"J6+J22+J38+J54+J70+J86","v":0}]
["Säugende Muttertiere mit Jungen bis zum Absetzen Mutter > 6kg",null,0.72,null,null,{"$f":"IF($B$3=\"Ja\",ROUNDDOWN(E7/C7,0),ROUNDDOWN(E7/C7,0))","v":0},null,{"$f":"IF(ISERROR(G7/E7),0,G7/E7)","v":0},{"$f":"IF(G7=0,F7,IF(ROUNDDOWN(E7/C7/(G7/(E7/2)),0)<(E7/C7),ROUNDDOWN(E7/C7/(G7/(E7/2)),0),ROUNDDOWN(E7/C7,0)))","v":0},null,2.5,null,{"$f":"ROUNDDOWN(L7/K7,0)","v":0},null,{"$f":"IF(L7=0,0,N7/L7)","v":0},{"$f":"IF(L7=0,0,IF(ROUNDDOWN((M7+(M7*-((N7-(L7*$O$4))/(L7-(L7*$O$4))))),0)>M7,M7,(ROUNDDOWN((M7+(M7*-((N7-(L7*$O$4))/(L7-(L7*$O$4))))),0))))","v":0},{"$f":"Berechnungstabellen!I88","v":0},null,"Säugende Muttertiere mit Jungen bis zum Absetzen Mutter > 6kg",null,{"$f":"Berechnungstabellen!J88","v":0},{"$f":"J7+J23+J39+J55+J71+J87","v":0}]
["Trächtige Tiere und weibliche Zuchtkaninchen < 6 kg",null,0.5,null,null,0,null,0,0,null,2.5,null,0,null,0,0,{"$f":"Berechnungstabellen!I89","v":0},null,"Trächtige Tiere und weibliche Zuchtkaninchen < 6 kg",null,{"$f":"Berechnungstabellen!J89","v":0},0]
["Trächtige Tiere und weibliche Zuchtkaninchen > 6 kg",null,0.62,null,null,0,null,0,0,null,2.5,null,0,null,0,0,{"$f":"Berechnungstabellen!I90","v":0},null,"Trächtige Tiere und weibliche Zuchtkaninchen > 6 kg",null,{"$f":"Berechnungstabellen!J90","v":0},0]
["Mastkaninchen vom Absetzen bis zur Schlachtung Nachzuchtkaninchen (vom Ende der Mast bis 6 Monate)",null,0.2,null,null,{"$f":"IF($B$3=\"Ja\",ROUNDDOWN(E10/C10,0),ROUNDDOWN(E10/0.15,0))","v":0},null,0,0,null,0.5,null,0,null,0,0,{"$f":"Berechnungstabellen!I91","v":0},null,"Mastkaninchen vom Absetzen bis zur Schlachtung Nachzuchtkaninchen (vom Ende der Mast bis 6 Monate)",null,{"$f":"Berechnungstabellen!J91","v":0},0]
["Erwachsene Rammler",null,0.6,null,null,{"$f":"ROUNDDOWN(E11/C11,0)","v":0},null,0,0,null,2.5,null,0,null,0,0,{"$f":"Berechnungstabellen!I92","v":0},null,"Erwachsene Rammler",null,{"$f":"Berechnungstabellen!J92","v":0},0]
["Erwachsene Rammler mit Weibchen zur Paarung",null,1,null,null,0,null,0,0,null,2.5,null,0,null,0,0,{"$f":"Berechnungstabellen!I93","v":0},null,"Erwachsene Rammler mit Weibchen zur Paarung",null,{"$f":"Berechnungstabellen!J93","v":0},0]
[]
["Geprüfte Maßangaben:"]
[]
["Anmerkungen / ANG´s"]
[]
["Stallblatt",2,"Stallname (bei mehreren Ställen: Je Stall ist das Formular jew. separat auszufüllen):",null,null,null,null,null,null,null,null,null,null,"Baujahr:"]
["Fester Stall",null,"Stallgebäude",null,null,null,null,null,null,null,"Außenfläche (muss planbefestigt sein!)"]
["Mobiler Stall",null,null,null,"Stallfläche",null,null,"Stallboden",null,null,null,null,null,"Überdachung max.",0.5]
["Tiergruppe",null,"benötigte \nm²/Tier","Stall- /Box-nummer(n) lt. Stall-plan","Stallfläche\nm² ","max. Tierzahl \nStallfläche","davon Spalten-boden / perforiert\nm²","in %","max. Tierzahl \nStallboden","Belegung\naktuell","benötigte \nm²/Tier","\nAußen-fläche\nm² ","max. Tierzahl \nAußenflächen","Über-dachung m2","Über-dachung %","max. Tierzahl \nÜber-dachung","Max. Tier-zahl"]
["Säugende Muttertiere mit Jungen bis zum Absetzen Mutter < 6kg",null,0.6,null,null,{"$f":"IF($B$19=\"Ja\",ROUNDDOWN(E22/C22,0),ROUNDDOWN(E22/C22,0))","v":0},null,{"$f":"IF(ISERROR(G22/E22),0,G22/E22)","v":0},{"$f":"IF(G22=0,F22,IF(ROUNDDOWN(E22/C22/(G22/(E22/2)),0)<(E22/C22),ROUNDDOWN(E22/C22/(G22/(E22/2)),0),ROUNDDOWN(E22/C22,0)))","v":0},null,2.5,null,{"$f":"ROUNDDOWN(L22/K22,0)","v":0},null,{"$f":"IF(L22=0,0,N22/L22)","v":0},{"$f":"IF(L22=0,0,IF(ROUNDDOWN((M22+(M22*-((N22-(L22*$O$4))/(L22-(L22*$O$4))))),0)>M22,M22,(ROUNDDOWN((M22+(M22*-((N22-(L22*$O$4))/(L22-(L22*$O$4))))),0))))","v":0},{"$f":"Berechnungstabellen!I95","v":0}]
["Säugende Muttertiere mit Jungen bis zum Absetzen Mutter > 6kg",null,0.72,null,null,{"$f":"IF($B$19=\"Ja\",ROUNDDOWN(E23/C23,0),ROUNDDOWN(E23/C23,0))","v":0},null,{"$f":"IF(ISERROR(G23/E23),0,G23/E23)","v":0},{"$f":"IF(G23=0,F23,IF(ROUNDDOWN(E23/C23/(G23/(E23/2)),0)<(E23/C23),ROUNDDOWN(E23/C23/(G23/(E23/2)),0),ROUNDDOWN(E23/C23,0)))","v":0},null,2.5,null,{"$f":"ROUNDDOWN(L23/K23,0)","v":0},null,{"$f":"IF(L23=0,0,N23/L23)","v":0},{"$f":"IF(L23=0,0,IF(ROUNDDOWN((M23+(M23*-((N23-(L23*$O$4))/(L23-(L23*$O$4))))),0)>M23,M23,(ROUNDDOWN((M23+(M23*-((N23-(L23*$O$4))/(L23-(L23*$O$4))))),0))))","v":0},{"$f":"Berechnungstabellen!I96","v":0}]
["Trächtige Tiere und weibliche Zuchtkaninchen < 6 kg",null,0.5,null,null,{"$f":"IF($B$19=\"Ja\",ROUNDDOWN(E24/C24,0),ROUNDDOWN(E24/C24,0))","v":0},null,0,0,null,2.5,null,0,null,0,0,{"$f":"Berechnungstabellen!I97","v":0}]
["Trächtige Tiere und weibliche Zuchtkaninchen > 6 kg",null,0.62,null,null,{"$f":"IF($B$19=\"Ja\",ROUNDDOWN(E25/C25,0),ROUNDDOWN(E25/C25,0))","v":0},null,0,0,null,2.5,null,0,null,0,0,{"$f":"Berechnungstabellen!I98","v":0}]
["Mastkaninchen vom Absetzen bis zur Schlachtung Nachzuchtkaninchen (vom Ende der Mast bis 6 Monate)",null,0.2,null,null,{"$f":"IF($B$19=\"Ja\",ROUNDDOWN(E26/C26,0),ROUNDDOWN(E26/0.15,0))","v":0},null,0,0,null,0.5,null,0,null,0,0,{"$f":"Berechnungstabellen!I99","v":0}]
["Erwachsene Rammler",null,0.6,null,null,{"$f":"ROUNDDOWN(E27/C27,0)","v":0},null,0,0,null,2.5,null,0,null,0,0,{"$f":"Berechnungstabellen!I100","v":0}]
["Erwachsene Rammler mit Weibchen zur Paarung",null,1,null,null,0,null,0,0,null,2.5,null,0,null,0,0,{"$f":"Berechnungstabellen!I101","v":0}]
[]
["Geprüfte Maßangaben:"]
[]
["Anmerkungen / ANG´s"]
[]
["Stallblatt",3,"Stallname (bei mehreren Ställen: Je Stall ist das Formular jew. separat auszufüllen):",null,null,null,null,null,null,null,null,null,null,"Baujahr:"]
["Fester Stall","JA","Stallgebäude",null,null,null,null,null,null,null,"Außenfläche (muss planbefestigt sein!)"]
["Mobiler Stall","NEIN",null,null,"Stallfläche",null,null,"Stallboden",null,null,null,null,null,"Überdachung max.",0.5]
["Tiergruppe",null,"benötigte \nm²/Tier","Stall- /Box-nummer(n) lt. Stall-plan","Stallfläche\nm² ","max. Tierzahl \nStallfläche","davon Spalten-boden / perforiert\nm²","in %","max. Tierzahl \nStallboden","Belegung\naktuell","benötigte \nm²/Tier","\nAußen-fläche\nm² ","max. Tierzahl \nAußenflächen","Über-dachung m2","Über-dachung %","max. Tierzahl \nÜber-dachung","Max. Tier-zahl"]
["Säugende Muttertiere mit Jungen bis zum Absetzen Mutter < 6kg",null,0.6,null,null,{"$f":"IF($B$35=\"Ja\",ROUNDDOWN(E38/C38,0),ROUNDDOWN(E38/C38,0))","v":0},null,{"$f":"IF(ISERROR(G38/E38),0,G38/E38)","v":0},{"$f":"IF(G38=0,F38,IF(ROUNDDOWN(E38/C38/(G38/(E38/2)),0)<(E38/C38),ROUNDDOWN(E38/C38/(G38/(E38/2)),0),ROUNDDOWN(E38/C38,0)))","v":0},null,2.5,null,{"$f":"ROUNDDOWN(L38/K38,0)","v":0},null,{"$f":"IF(L38=0,0,N38/L38)","v":0},{"$f":"IF(L38=0,0,IF(ROUNDDOWN((M38+(M38*-((N38-(L38*$O$4))/(L38-(L38*$O$4))))),0)>M38,M38,(ROUNDDOWN((M38+(M38*-((N38-(L38*$O$4))/(L38-(L38*$O$4))))),0))))","v":0},{"$f":"Berechnungstabellen!I103","v":0}]
["Säugende Muttertiere mit Jungen bis zum Absetzen Mutter > 6kg",null,0.72,null,null,{"$f":"IF($B$35=\"Ja\",ROUNDDOWN(E39/C39,0),ROUNDDOWN(E39/C39,0))","v":0},null,{"$f":"IF(ISERROR(G39/E39),0,G39/E39)","v":0},{"$f":"IF(G39=0,F39,IF(ROUNDDOWN(E39/C39/(G39/(E39/2)),0)<(E39/C39),ROUNDDOWN(E39/C39/(G39/(E39/2)),0),ROUNDDOWN(E39/C39,0)))","v":0},null,2.5,null,{"$f":"ROUNDDOWN(L39/K39,0)","v":0},null,{"$f":"IF(L39=0,0,N39/L39)","v":0},{"$f":"IF(L39=0,0,IF(ROUNDDOWN((M39+(M39*-((N39-(L39*$O$4))/(L39-(L39*$O$4))))),0)>M39,M39,(ROUNDDOWN((M39+(M39*-((N39-(L39*$O$4))/(L39-(L39*$O$4))))),0))))","v":0},{"$f":"Berechnungstabellen!I104","v":0}]
["Trächtige Tiere und weibliche Zuchtkaninchen < 6 kg",null,0.5,null,null,{"$f":"IF($B$35=\"Ja\",ROUNDDOWN(E40/C40,0),ROUNDDOWN(E40/C40,0))","v":0},null,0,0,null,2.5,null,0,null,0,0,{"$f":"Berechnungstabellen!I105","v":0}]
["Trächtige Tiere und weibliche Zuchtkaninchen > 6 kg",null,0.62,null,null,{"$f":"IF($B$35=\"Ja\",ROUNDDOWN(E41/C41,0),ROUNDDOWN(E41/C41,0))","v":0},null,0,0,null,2.5,null,0,null,0,0,{"$f":"Berechnungstabellen!I106","v":0}]
["Mastkaninchen vom Absetzen bis zur Schlachtung Nachzuchtkaninchen (vom Ende der Mast bis 6 Monate)",null,0.2,null,null,{"$f":"IF($B$35=\"Ja\",ROUNDDOWN(E42/C42,0),ROUNDDOWN(E42/0.15,0))","v":0},null,0,0,null,0.5,null,0,null,0,0,{"$f":"Berechnungstabellen!I107","v":0}]
["Erwachsene Rammler",null,0.6,null,null,{"$f":"ROUNDDOWN(E43/C43,0)","v":0},null,0,0,null,2.5,null,0,null,0,0,{"$f":"Berechnungstabellen!I108","v":0}]
["Erwachsene Rammler mit Weibchen zur Paarung",null,1,null,null,0,null,0,0,null,2.5,null,0,null,0,0,{"$f":"Berechnungstabellen!I109","v":0}]
[]
["Geprüfte Maßangaben:"]
[]
["Anmerkungen / ANG´s"]
[]
["Stallblatt",4,"Stallname (bei mehreren Ställen: Je Stall ist das Formular jew. separat auszufüllen):",null,null,null,null,null,null,null,null,null,null,"Baujahr:"]
["Fester Stall",null,"Stallgebäude",null,null,null,null,null,null,null,"Außenfläche (muss planbefestigt sein!)"]
["Mobiler Stall",null,null,null,"Stallfläche",null,null,"Stallboden",null,null,null,null,null,"Überdachung max.",0.5]
["Tiergruppe",null,"benötigte \nm²/Tier","Stall- /Box-nummer(n) lt. Stall-plan","Stallfläche\nm² ","max. Tierzahl \nStallfläche","davon Spalten-boden / perforiert\nm²","in %","max. Tierzahl \nStallboden","Belegung\naktuell","benötigte \nm²/Tier","\nAußen-fläche\nm² ","max. Tierzahl \nAußenflächen","Über-dachung m2","Über-dachung %","max. Tierzahl \nÜber-dachung","Max. Tier-zahl"]
["Säugende Muttertiere mit Jungen bis zum Absetzen Mutter < 6kg",null,0.6,null,null,{"$f":"IF($B$51=\"Ja\",ROUNDDOWN(E54/C54,0),ROUNDDOWN(E54/C54,0))","v":0},null,{"$f":"IF(ISERROR(G54/E54),0,G54/E54)","v":0},{"$f":"IF(G54=0,F54,IF(ROUNDDOWN(E54/C54/(G54/(E54/2)),0)<(E54/C54),ROUNDDOWN(E54/C54/(G54/(E54/2)),0),ROUNDDOWN(E54/C54,0)))","v":0},null,2.5,null,{"$f":"ROUNDDOWN(L54/K54,0)","v":0},null,{"$f":"IF(L54=0,0,N54/L54)","v":0},{"$f":"IF(L54=0,0,IF(ROUNDDOWN((M54+(M54*-((N54-(L54*$O$4))/(L54-(L54*$O$4))))),0)>M54,M54,(ROUNDDOWN((M54+(M54*-((N54-(L54*$O$4))/(L54-(L54*$O$4))))),0))))","v":0},{"$f":"Berechnungstabellen!I111","v":0}]
["Säugende Muttertiere mit Jungen bis zum Absetzen Mutter > 6kg",null,0.72,null,null,{"$f":"IF($B$51=\"Ja\",ROUNDDOWN(E55/C55,0),ROUNDDOWN(E55/C55,0))","v":0},null,{"$f":"IF(ISERROR(G55/E55),0,G55/E55)","v":0},{"$f":"IF(G55=0,F55,IF(ROUNDDOWN(E55/C55/(G55/(E55/2)),0)<(E55/C55),ROUNDDOWN(E55/C55/(G55/(E55/2)),0),ROUNDDOWN(E55/C55,0)))","v":0},null,2.5,null,{"$f":"ROUNDDOWN(L55/K55,0)","v":0},null,{"$f":"IF(L55=0,0,N55/L55)","v":0},{"$f":"IF(L55=0,0,IF(ROUNDDOWN((M55+(M55*-((N55-(L55*$O$4))/(L55-(L55*$O$4))))),0)>M55,M55,(ROUNDDOWN((M55+(M55*-((N55-(L55*$O$4))/(L55-(L55*$O$4))))),0))))","v":0},{"$f":"Berechnungstabellen!I112","v":0}]
["Trächtige Tiere und weibliche Zuchtkaninchen < 6 kg",null,0.5,null,null,{"$f":"IF($B$51=\"Ja\",ROUNDDOWN(E56/C56,0),ROUNDDOWN(E56/C56,0))","v":0},null,0,0,null,2.5,null,0,null,0,0,{"$f":"Berechnungstabellen!I113","v":0}]
["Trächtige Tiere und weibliche Zuchtkaninchen > 6 kg",null,0.62,null,null,{"$f":"IF($B$51=\"Ja\",ROUNDDOWN(E57/C57,0),ROUNDDOWN(E57/C57,0))","v":0},null,0,0,null,2.5,null,0,null,0,0,{"$f":"Berechnungstabellen!I114","v":0}]
["Mastkaninchen vom Absetzen bis zur Schlachtung Nachzuchtkaninchen (vom Ende der Mast bis 6 Monate)",null,0.2,null,null,{"$f":"IF($B$51=\"Ja\",ROUNDDOWN(E58/C58,0),ROUNDDOWN(E58/0.15,0))","v":0},null,0,0,null,0.5,null,0,null,0,0,{"$f":"Berechnungstabellen!I115","v":0}]
["Erwachsene Rammler",null,0.6,null,null,{"$f":"ROUNDDOWN(E59/C59,0)","v":0},null,0,0,null,2.5,null,0,null,0,0,{"$f":"Berechnungstabellen!I116","v":0}]
["Erwachsene Rammler mit Weibchen zur Paarung",null,1,null,null,0,null,0,0,null,2.5,null,0,null,0,0,{"$f":"Berechnungstabellen!I117","v":0}]
[]
["Geprüfte Maßangaben:"]
[]
["Anmerkungen / ANG´s"]
[]
["Stallblatt",5,"Stallname (bei mehreren Ställen: Je Stall ist das Formular jew. separat auszufüllen):",null,null,null,null,null,null,null,null,null,null,"Baujahr:"]
["Fester Stall",null,"Stallgebäude",null,null,null,null,null,null,null,"Außenfläche (muss planbefestigt sein!)"]
["Mobiler Stall",null,null,null,"Stallfläche",null,null,"Stallboden",null,null,null,null,null,"Überdachung max.",0.5]
["Tiergruppe",null,"benötigte \nm²/Tier","Stall- /Box-nummer(n) lt. Stall-plan","Stallfläche\nm² ","max. Tierzahl \nStallfläche","davon Spalten-boden / perforiert\nm²","in %","max. Tierzahl \nStallboden","Belegung\naktuell","benötigte \nm²/Tier","\nAußen-fläche\nm² ","max. Tierzahl \nAußenflächen","Über-dachung m2","Über-dachung %","max. Tierzahl \nÜber-dachung","Max. Tier-zahl"]
["Säugende Muttertiere mit Jungen bis zum Absetzen Mutter < 6kg",null,0.6,null,null,{"$f":"IF($B$67=\"Ja\",ROUNDDOWN(E70/C70,0),ROUNDDOWN(E70/C70,0))","v":0},null,{"$f":"IF(ISERROR(G70/E70),0,G70/E70)","v":0},{"$f":"IF(G70=0,F70,IF(ROUNDDOWN(E70/C70/(G70/(E70/2)),0)<(E70/C70),ROUNDDOWN(E70/C70/(G70/(E70/2)),0),ROUNDDOWN(E70/C70,0)))","v":0},null,2.5,null,{"$f":"ROUNDDOWN(L70/K70,0)","v":0},null,{"$f":"IF(L70=0,0,N70/L70)","v":0},{"$f":"IF(L70=0,0,IF(ROUNDDOWN((M70+(M70*-((N70-(L70*$O$4))/(L70-(L70*$O$4))))),0)>M70,M70,(ROUNDDOWN((M70+(M70*-((N70-(L70*$O$4))/(L70-(L70*$O$4))))),0))))","v":0},{"$f":"Berechnungstabellen!I119","v":0}]
["Säugende Muttertiere mit Jungen bis zum Absetzen Mutter > 6kg",null,0.72,null,null,{"$f":"IF($B$67=\"Ja\",ROUNDDOWN(E71/C71,0),ROUNDDOWN(E71/C71,0))","v":0},null,{"$f":"IF(ISERROR(G71/E71),0,G71/E71)","v":0},{"$f":"IF(G71=0,F71,IF(ROUNDDOWN(E71/C71/(G71/(E71/2)),0)<(E71/C71),ROUNDDOWN(E71/C71/(G71/(E71/2)),0),ROUNDDOWN(E71/C71,0)))","v":0},null,2.5,null,{"$f":"ROUNDDOWN(L71/K71,0)","v":0},null,{"$f":"IF(L71=0,0,N71/L71)","v":0},{"$f":"IF(L71=0,0,IF(ROUNDDOWN((M71+(M71*-((N71-(L71*$O$4))/(L71-(L71*$O$4))))),0)>M71,M71,(ROUNDDOWN((M71+(M71*-((N71-(L71*$O$4))/(L71-(L71*$O$4))))),0))))","v":0},{"$f":"Berechnungstabellen!I120","v":0}]
["Trächtige Tiere und weibliche Zuchtkaninchen < 6 kg",null,0.5,null,null,{"$f":"IF($B$67=\"Ja\",ROUNDDOWN(E72/C72,0),ROUNDDOWN(E72/C72,0))","v":0},null,0,0,null,2.5,null,0,null,0,0,{"$f":"Berechnungstabellen!I121","v":0}]
["Trächtige Tiere und weibliche Zuchtkaninchen > 6 kg",null,0.62,null,null,{"$f":"IF($B$67=\"Ja\",ROUNDDOWN(E73/C73,0),ROUNDDOWN(E73/C73,0))","v":0},null,0,0,null,2.5,null,0,null,0,0,{"$f":"Berechnungstabellen!I122","v":0}]
["Mastkaninchen vom Absetzen bis zur Schlachtung Nachzuchtkaninchen (vom Ende der Mast bis 6 Monate)",null,0.2,null,null,{"$f":"IF($B$67=\"Ja\",ROUNDDOWN(E74/C74,0),ROUNDDOWN(E74/0.15,0))","v":0},null,0,0,null,0.5,null,0,null,0,0,{"$f":"Berechnungstabellen!I123","v":0}]
["Erwachsene Rammler",null,0.6,null,null,{"$f":"ROUNDDOWN(E75/C75,0)","v":0},null,0,0,null,2.5,null,0,null,0,0,{"$f":"Berechnungstabellen!I124","v":0}]
["Erwachsene Rammler mit Weibchen zur Paarung",null,1,null,null,0,null,0,0,null,2.5,null,0,null,0,0,{"$f":"Berechnungstabellen!I125","v":0}]
[]
["Geprüfte Maßangaben:"]
[]
["Anmerkungen / ANG´s"]
[]
["Stallblatt",6,"Stallname (bei mehreren Ställen: Je Stall ist das Formular jew. separat auszufüllen):",null,null,null,null,null,null,null,null,null,null,"Baujahr:"]
["Fester Stall","JA","Stallgebäude",null,null,null,null,null,null,null,"Außenfläche (muss planbefestigt sein!)"]
["Mobiler Stall","NEIN",null,null,"Stallfläche",null,null,"Stallboden",null,null,null,null,null,"Überdachung max.",0.5]
["Tiergruppe",null,"benötigte \nm²/Tier","Stall- /Box-nummer(n) lt. Stall-plan","Stallfläche\nm² ","max. Tierzahl \nStallfläche","davon Spalten-boden / perforiert\nm²","in %","max. Tierzahl \nStallboden","Belegung\naktuell","benötigte \nm²/Tier","\nAußen-fläche\nm² ","max. Tierzahl \nAußenflächen","Über-dachung m2","Über-dachung %","max. Tierzahl \nÜber-dachung","Max. Tier-zahl"]
["Säugende Muttertiere mit Jungen bis zum Absetzen Mutter < 6kg",null,0.6,null,null,{"$f":"IF($B$83=\"Ja\",ROUNDDOWN(E86/C86,0),ROUNDDOWN(E86/C86,0))","v":0},null,{"$f":"IF(ISERROR(G86/E86),0,G86/E86)","v":0},{"$f":"IF(G86=0,F86,IF(ROUNDDOWN(E86/C86/(G86/(E86/2)),0)<(E86/C86),ROUNDDOWN(E86/C86/(G86/(E86/2)),0),ROUNDDOWN(E86/C86,0)))","v":0},null,2.5,null,{"$f":"ROUNDDOWN(L86/K86,0)","v":0},null,{"$f":"IF(L86=0,0,N86/L86)","v":0},{"$f":"IF(L86=0,0,IF(ROUNDDOWN((M86+(M86*-((N86-(L86*$O$4))/(L86-(L86*$O$4))))),0)>M86,M86,(ROUNDDOWN((M86+(M86*-((N86-(L86*$O$4))/(L86-(L86*$O$4))))),0))))","v":0},{"$f":"Berechnungstabellen!I127","v":0}]
["Säugende Muttertiere mit Jungen bis zum Absetzen Mutter > 6kg",null,0.72,null,null,{"$f":"IF($B$83=\"Ja\",ROUNDDOWN(E87/C87,0),ROUNDDOWN(E87/C87,0))","v":0},null,{"$f":"IF(ISERROR(G87/E87),0,G87/E87)","v":0},{"$f":"IF(G87=0,F87,IF(ROUNDDOWN(E87/C87/(G87/(E87/2)),0)<(E87/C87),ROUNDDOWN(E87/C87/(G87/(E87/2)),0),ROUNDDOWN(E87/C87,0)))","v":0},null,2.5,null,{"$f":"ROUNDDOWN(L87/K87,0)","v":0},null,{"$f":"IF(L87=0,0,N87/L87)","v":0},{"$f":"IF(L87=0,0,IF(ROUNDDOWN((M87+(M87*-((N87-(L87*$O$4))/(L87-(L87*$O$4))))),0)>M87,M87,(ROUNDDOWN((M87+(M87*-((N87-(L87*$O$4))/(L87-(L87*$O$4))))),0))))","v":0},{"$f":"Berechnungstabellen!I128","v":0}]
["Trächtige Tiere und weibliche Zuchtkaninchen < 6 kg",null,0.5,null,null,{"$f":"IF($B$83=\"Ja\",ROUNDDOWN(E88/C88,0),ROUNDDOWN(E88/C88,0))","v":0},null,0,0,null,2.5,null,0,null,0,0,{"$f":"Berechnungstabellen!I129","v":0}]
["Trächtige Tiere und weibliche Zuchtkaninchen > 6 kg",null,0.62,null,null,{"$f":"IF($B$83=\"Ja\",ROUNDDOWN(E89/C89,0),ROUNDDOWN(E89/C89,0))","v":0},null,0,0,null,2.5,null,0,null,0,0,{"$f":"Berechnungstabellen!I130","v":0}]
["Mastkaninchen vom Absetzen bis zur Schlachtung Nachzuchtkaninchen (vom Ende der Mast bis 6 Monate)",null,0.2,null,null,{"$f":"IF($B$83=\"Ja\",ROUNDDOWN(E90/C90,0),ROUNDDOWN(E90/0.15,0))","v":0},null,0,0,null,0.5,null,0,null,0,0,{"$f":"Berechnungstabellen!I131","v":0}]
["Erwachsene Rammler",null,0.6,null,null,{"$f":"ROUNDDOWN(E91/C91,0)","v":0},null,0,0,null,2.5,null,0,null,0,0,{"$f":"Berechnungstabellen!I132","v":0}]
["Erwachsene Rammler mit Weibchen zur Paarung",null,1,null,null,0,null,0,0,null,2.5,null,0,null,0,0,{"$f":"Berechnungstabellen!I133","v":0}]
[]
["Geprüfte Maßangaben:"]
[]
["Anmerkungen / ANG´s"]

{"sheet":"Geweihträger","index":6,"n_rows":78,"n_cols":15,"rows_kept":78,"cut":false,"hidden":false,"merged":[[2,0,2,1],[3,0,3,1],[4,0,4,1],[5,0,5,1],[4,11,4,12],[5,11,5,12],[16,0,16,1],[17,0,17,1],[7,11,7,12],[8,11,8,12],[3,11,3,12],[6,0,6,1],[6,11,6,12],[7,0,7,1],[8,0,8,1],[10,2,10,9],[14,5,14,6],[15,0,15,1],[54,0,54,1],[55,0,55,1],[33,0,33,1],[18,0,18,1],[19,0,19,1],[20,0,20,1],[21,0,21,1],[28,0,28,1],[29,0,29,1],[30,0,30,1],[31,0,31,1],[32,0,32,1],[43,0,43,1],[44,0,44,1],[45,0,45,1],[46,0,46,1],[47,0,47,1],[34,0,34,1],[36,2,36,9],[40,5,40,6],[41,0,41,1],[42,0,42,1],[56,0,56,1],[57,0,57,1],[58,0,58,1],[71,0,71,1],[72,0,72,1],[59,0,59,1],[60,0,60,1],[73,0,73,1],[75,2,75,9],[62,2,62,9],[66,5,66,6],[67,0,67,1],[68,0,68,1],[70,0,70,1],[69,0,69,1],[77,2,77,9],[0,11,0,14],[12,2,12,9],[25,2,25,9],[38,2,38,9],[51,2,51,9],[64,2,64,9],[2,11,2,12],[1,11,1,14],[53,5,53,6],[49,2,49,9],[23,2,23,9],[27,5,27,6],[1,5,1,6]]}
["Ermittlung der maximalen Tierzahl, die gem. EU VO 2018/848 sowie 2020/464 Anhang I Teil II je Gehege gehalten werden darf",null,null,null,null,null,null,null,null,"Geweihträger",null,"Zum Abgleich Eingabe Ecert mit Bestandsregister"]
["Gehegeblatt",1,"Gehegename (bei mehreren Gehegen: Je Gehege ist das Formular jew. separat auszufüllen):",null,null,null,null,"Baujahr:",null,null,null,"Max. Tierzahl ges. über alle Ställe"]
["Tiergruppe",null,"Mindestgröße Gehege (ha)","Gehegeabteil lt. Gehegeplan","Gehegegröße ha","Mindestgröße Gehege liegt vor","Besatzdichte, d. h. Höchstzahl erwachsener Tiere (*)pro ha","max. Tierzahl \nGehegeabteil","Belegung\naktuell","Max. Tier-zahl",null,null,null,"Max Tierzahl ges.","Gehaltene Tiere"]
["Sikahirsch",null,1,null,null,{"$f":"IF(E4<C4,\"Nein\",\"Ja\")","v":"Nein"},15,{"$f":"IF(F4=\"Nein\",0,ROUNDDOWN(E4*G4,0))","v":0},null,{"$f":"H4","v":0},null,"Sikahirsch",null,{"$f":"Berechnungstabellen!J136","v":0},{"$f":"I4+I17+I30+I43+I56+I69","v":0}]
["Damhirsch",null,1,null,null,{"$f":"IF(E5<C5,\"Nein\",\"Ja\")","v":"Nein"},15,{"$f":"IF(F5=\"Nein\",0,ROUNDDOWN(E5*G5,0))","v":0},null,{"$f":"H5","v":0},null,"Damhirsch",null,{"$f":"Berechnungstabellen!J137","v":0},{"$f":"I5+I18+I31+I44+I57+I70","v":0}]
["Rothirsch",null,2,null,null,"Nein",7,0,null,0,null,"Rothirsch",null,{"$f":"Berechnungstabellen!J138","v":0},{"$f":"I6+I19+I32+I45+I58+I71","v":0}]
["Davidshirsch",null,2,null,null,"Nein",7,0,null,0,null,"Davidshirsch",null,{"$f":"Berechnungstabellen!J139","v":0},0]
["Mehr als eine Geweihträgerart (MIT Rot- oder Davidshirsch in der Herde)",null,3,null,null,"Nein",7,0,null,0,null,"Mehr als eine Geweihträgerart (MIT Rot- oder Davidshirsch in der Herde)",null,{"$f":"Berechnungstabellen!J140","v":0},0]
["Mehr als eine Geweihträgerart (OHNE Rot- oder Davidshirsch in der Herde)",null,3,null,null,"Nein",15,0,null,0,null,"Mehr als eine Geweihträgerart (OHNE Rot- oder Davidshirsch in der Herde)",null,{"$f":"ROUNDUP(Berechnungstabellen!J141,0)","v":0},0]
["(*) Zwei bis zu 18 Monate alte Geweihträger gelten als ein Geweihträger."]
["Geprüfte Maßangaben:"]
[]
["Anmerkungen / ANG´s"]
[]
["Gehegeblatt",2,"Gehegename (bei mehreren Gehegen: Je Gehege ist das Formular jew. separat auszufüllen):",null,null,null,null,"Baujahr:"]
["Tiergruppe",null,"Mindestgröße Gehege (ha)","Gehegeabteil lt. Gehegeplan","Gehegegröße ha","Mindestgröße Gehege liegt vor","Besatzdichte, d. h. Höchstzahl erwachsener Tiere (*)pro ha","max. Tierzahl \nGehegeabteil","Belegung\naktuell","Max. Tier-zahl"]
["Sikahirsch",null,1,null,null,{"$f":"IF(E17<C17,\"Nein\",\"Ja\")","v":"Nein"},15,{"$f":"IF(F17=\"Nein\",0,ROUNDDOWN(E17*G17,0))","v":0},null,{"$f":"H17","v":0}]
["Damhirsch",null,1,null,null,{"$f":"IF(E18<C18,\"Nein\",\"Ja\")","v":"Nein"},15,{"$f":"IF(F18=\"Nein\",0,ROUNDDOWN(E18*G18,0))","v":0},null,{"$f":"H18","v":0}]
["Rothirsch",null,2,null,null,"Nein",7,0,null,0]
["Davidshirsch",null,2,null,null,"Nein",7,0,null,0]
["Mehr als eine Geweihträgerart (MIT Rot- oder Davidshirsch in der Herde)",null,3,null,null,"Nein",7,0,null,0]
["Mehr als eine Geweihträgerart (OHNE Rot- oder Davidshirsch in der Herde)",null,3,null,null,"Nein",15,0,null,0]
["(*) Zwei bis zu 18 Monate alte Geweihträger gelten als ein Geweihträger."]
["Geprüfte Maßangaben:"]
[]
["Anmerkungen / ANG´s"]
[]
["Gehegeblatt",3,"Gehegename (bei mehreren Gehegen: Je Gehege ist das Formular jew. separat auszufüllen):",null,null,null,null,"Baujahr:"]
["Tiergruppe",null,"Mindestgröße Gehege (ha)","Gehegeabteil lt. Gehegeplan","Gehegegröße ha","Mindestgröße Gehege liegt vor","Besatzdichte, d. h. Höchstzahl erwachsener Tiere (*)pro ha","max. Tierzahl \nGehegeabteil","Belegung\naktuell","Max. Tier-zahl"]
["Sikahirsch",null,1,null,null,{"$f":"IF(E30<C30,\"Nein\",\"Ja\")","v":"Nein"},15,{"$f":"IF(F30=\"Nein\",0,ROUNDDOWN(E30*G30,0))","v":0},null,{"$f":"H30","v":0}]
["Damhirsch",null,1,null,null,{"$f":"IF(E31<C31,\"Nein\",\"Ja\")","v":"Nein"},15,{"$f":"IF(F31=\"Nein\",0,ROUNDDOWN(E31*G31,0))","v":0},null,{"$f":"H31","v":0}]
["Rothirsch",null,2,null,null,"Nein",7,0,null,0]
["Davidshirsch",null,2,null,null,"Nein",7,0,null,0]
["Mehr als eine Geweihträgerart (MIT Rot- oder Davidshirsch in der Herde)",null,3,null,null,"Nein",7,0,null,0]
["Mehr als eine Geweihträgerart (OHNE Rot- oder Davidshirsch in der Herde)",null,3,null,null,"Nein",15,0,null,0]
["(*) Zwei bis zu 18 Monate alte Geweihträger gelten als ein Geweihträger."]
["Geprüfte Maßangaben:"]
[]
["Anmerkungen / ANG´s"]
[]
["Gehegeblatt",4,"Gehegename (bei mehreren Gehegen: Je Gehege ist das Formular jew. separat auszufüllen):",null,null,null,null,"Baujahr:"]
["Tiergruppe",null,"Mindestgröße Gehege (ha)","Gehegeabteil lt. Gehegeplan","Gehegegröße ha","Mindestgröße Gehege liegt vor","Besatzdichte, d. h. Höchstzahl erwachsener Tiere (*)pro ha","max. Tierzahl \nGehegeabteil","Belegung\naktuell","Max. Tier-zahl"]
["Sikahirsch",null,1,null,null,{"$f":"IF(E43<C43,\"Nein\",\"Ja\")","v":"Nein"},15,{"$f":"IF(F43=\"Nein\",0,ROUNDDOWN(E43*G43,0))","v":0},null,{"$f":"H43","v":0}]
["Damhirsch",null,1,null,null,{"$f":"IF(E44<C44,\"Nein\",\"Ja\")","v":"Nein"},15,{"$f":"IF(F44=\"Nein\",0,ROUNDDOWN(E44*G44,0))","v":0},null,{"$f":"H44","v":0}]
["Rothirsch",null,2,null,null,"Nein",7,0,null,0]
["Davidshirsch",null,2,null,null,"Nein",7,0,null,0]
["Mehr als eine Geweihträgerart (MIT Rot- oder Davidshirsch in der Herde)",null,3,null,null,"Nein",7,0,null,0]
["Mehr als eine Geweihträgerart (OHNE Rot- oder Davidshirsch in der Herde)",null,3,null,null,"Nein",15,0,null,0]
["(*) Zwei bis zu 18 Monate alte Geweihträger gelten als ein Geweihträger."]
["Geprüfte Maßangaben:"]
[]
["Anmerkungen / ANG´s"]
[]
["Gehegeblatt",5,"Gehegename (bei mehreren Gehegen: Je Gehege ist das Formular jew. separat auszufüllen):",null,null,null,null,"Baujahr:"]
["Tiergruppe",null,"Mindestgröße Gehege (ha)","Gehegeabteil lt. Gehegeplan","Gehegegröße ha","Mindestgröße Gehege liegt vor","Besatzdichte, d. h. Höchstzahl erwachsener Tiere (*)pro ha","max. Tierzahl \nGehegeabteil","Belegung\naktuell","Max. Tier-zahl"]
["Sikahirsch",null,1,null,null,{"$f":"IF(E56<C56,\"Nein\",\"Ja\")","v":"Nein"},15,{"$f":"IF(F56=\"Nein\",0,ROUNDDOWN(E56*G56,0))","v":0},null,{"$f":"H56","v":0}]
["Damhirsch",null,1,null,null,{"$f":"IF(E57<C57,\"Nein\",\"Ja\")","v":"Nein"},15,{"$f":"IF(F57=\"Nein\",0,ROUNDDOWN(E57*G57,0))","v":0},null,{"$f":"H57","v":0}]
["Rothirsch",null,2,null,null,"Nein",7,0,null,0]
["Davidshirsch",null,2,null,null,"Nein",7,0,null,0]
["Mehr als eine Geweihträgerart (MIT Rot- oder Davidshirsch in der Herde)",null,3,null,null,"Nein",7,0,null,0]
["Mehr als eine Geweihträgerart (OHNE Rot- oder Davidshirsch in der Herde)",null,3,null,null,"Nein",15,0,null,0]
["(*) Zwei bis zu 18 Monate alte Geweihträger gelten als ein Geweihträger."]
["Geprüfte Maßangaben:"]
[]
["Anmerkungen / ANG´s"]
[]
["Gehegeblatt",6,"Gehegename (bei mehreren Gehegen: Je Gehege ist das Formular jew. separat auszufüllen):",null,null,null,null,"Baujahr:"]
["Tiergruppe",null,"Mindestgröße Gehege (ha)","Gehegeabteil lt. Gehegeplan","Gehegegröße ha","Mindestgröße Gehege liegt vor","Besatzdichte, d. h. Höchstzahl erwachsener Tiere (*)pro ha","max. Tierzahl \nGehegeabteil","Belegung\naktuell","Max. Tier-zahl"]
["Sikahirsch",null,1,null,null,{"$f":"IF(E69<C69,\"Nein\",\"Ja\")","v":"Nein"},15,{"$f":"IF(F69=\"Nein\",0,ROUNDDOWN(E69*G69,0))","v":0},null,{"$f":"H69","v":0}]
["Damhirsch",null,1,null,null,{"$f":"IF(E70<C70,\"Nein\",\"Ja\")","v":"Nein"},15,{"$f":"IF(F70=\"Nein\",0,ROUNDDOWN(E70*G70,0))","v":0},null,{"$f":"H70","v":0}]
["Rothirsch",null,2,null,null,"Nein",7,0,null,0]
["Davidshirsch",null,2,null,null,"Nein",7,0,null,0]
["Mehr als eine Geweihträgerart (MIT Rot- oder Davidshirsch in der Herde)",null,3,null,null,"Nein",7,0,null,0]
["Mehr als eine Geweihträgerart (OHNE Rot- oder Davidshirsch in der Herde)",null,3,null,null,"Nein",15,0,null,0]
["(*) Zwei bis zu 18 Monate alte Geweihträger gelten als ein Geweihträger."]
["Geprüfte Maßangaben:"]
[]
["Anmerkungen / ANG´s"]

{"sheet":"Legehennen","index":7,"n_rows":28,"n_cols":59,"rows_kept":28,"cut":false,"hidden":false,"merged":[[27,3,27,34],[1,30,1,32],[2,3,2,4],[25,3,25,34],[4,27,4,29],[4,19,4,20],[4,21,4,22],[4,30,4,32],[1,24,1,26]]}
["Ermittlung der maximalen Tierzahl, die gem. EU VO 2018/848 sowie 2020/464 Anhang I je Stall gehalten werden darf",null,null,null,null,null,null,null,null,null,null,null,null,null,null,null,null,null,null,null,null,null,null,null,null,null,null,null,null,null,null,null,null,null,null,null,null,null,null,null,null,null,null,null,null,null,null,null,null,null,null,null,null,null,null,null,null,null,"Legehennen"]
[null,null,"Allg. Angaben",{"$f":"TODAY()","v":"2025-05-23"},"Belegung",null,null,"Tierverluste",null,null,null,null,null,"Stall",null,null,null,"Sitzstangen ",null,"Nestfläche",null,null,null,null,"Luken \n(Stall-AKB)",null,null,null,"Scharraumfläche",null,"Auslauföffnungen\n(AKB – Auslauf)",null,null,"Auslauf \n(bis 150 /350 m)",null,null,"Zusatzangaben: gem. TierSchNutztV (verpflichtend!)",null,null,null,null,null,null,null,"Info zur Sollermittlung: Bezugswert = Anzahl Tiere bei Einstallung",null,null,null,null,null,null,null,null,null,null,null,"Auswertung"]
[null,null,null,"max. Belegung je Stall:",null,3000,null,null,null,"Voliere Ebenen",null,null,"Warm-\nstall","Isolierte  Veranda","Ergebnis Stall",null,null,null,null,null,null,null,null,null,null,null,null,null,null,null,null,null,null,null,null,null,null,null,null,"Futter",null,null,null,null,null,null,null,null,"Tränken",null,null,null,null,null,null,"Überschreitung bei Einstallung",null,"Überschreitung aktuell"]
["Name\nStall (lt. Stall-plan)","Baujahr","Kenn- bzw. Print-Nr. nach LegReG","Einstall-\ndatum","Tierzahl\nbei Ein-stallung","Belegung\nakt.","Gesamt (Anzahl Tiere)","Tiere je Tag","%","Ebenen max","Ebenen ist","Tiere Max.","m²","m²\njederzeit nutzbar\n","Summe \nm²","Kapa-\nzität\n(Tier-zahl)","soll m","ist\nm","Kapa-\nzität\n(Tier-zahl)","ist \nm²","Kapa-\nzität\n(Tier-zahl)","ist\nAn-zahl","Kapa-\nzität\n(Tier-zahl)","Kapa-\nzität\n(Tier-zahl) Nester","soll m","ist\nm","Kapa-\nzität\n(Tierzahl)","soll\nm²","ist\nm²","Kapa-\nzität\n(Tier-zahl)","soll\nm","ist\nm","Kapa-\nzität\n(Tier-zahl)","ist\nm²","Kapa-\nzität\n(Tier-zahl)",null,"Stall","Futtertröge Rinnen",null,null," Futtertröge Rund",null,null,"Futtertröge ges.","Tränkeanzahl (Nippel)",null,null,"Rinnentränke",null,null,"Rundtränke",null,null,"Tränken ges.","Kapa-\nzität \nMin. aller Krite-\nrien \n","Anzahl Tiere","Einstal-lung\n%","Anzahl Tiere","aktuell %"]
[null,null,null,null,null,null,".",null,null,null,null,null,null,null,"max. Tiere / m²:",6,"mind. ",0.18,"m / Tier","Gemeinsch. Nester\nmind. 120cm²/T.",null,"Einzelnester\n7 LH/Nest",null,null,"mind. 2m/500 Tiere",null,null,"mind. 1/3 der notw. Fläche",null,null,"mind. 4m/100m²",null,null,"mind. m²/Tier:",4,null,null,"soll (cm)","ist (cm)","Kapa-\nzität\n(Tierzahl)","soll (cm)","ist (cm)","Kapa-\nzität\n(Tierzahl)","Kapa-\nzität\n(Tierzahl)","soll","ist (Anzahl)","Kapa-\nzität\n(Tierzahl)","soll (cm)","ist (cm)","Kapa-\nzität\n(Tierzahl)","soll (cm)","ist (cm)","Kapa-\nzität\n(Tierzahl)","Summe Tränken"]
[null,null,null,null,null,null,{"$f":"E6-F6","v":0},{"$f":"IF(F6=0,0,G6/(D$2-D6))","v":0},{"$f":"IF(E6=0,0,IF(F6=0,0,1-(F6/E6)))","v":0},{"$f":"IF(B6=0,0,IF(B6<\"2021\",4,3))","v":0},null,{"$f":"IF(B6=0,0,IF(K6>J6,0,$F$3))","v":0},null,null,{"$f":"SUM(M6:N6)","v":0},{"$f":"IF(ROUNDDOWN(O6*$P$5,0)>$F$3,$F$3,(ROUNDDOWN(O6*$P$5,0)))","v":0},{"$f":"F6*$R$5","v":0},null,{"$f":"IF(ROUNDDOWN(R6/0.18,0)>$F$3,$F$3,(ROUNDDOWN(R6/0.18,0)))","v":0},null,{"$f":"IF(ROUNDDOWN(T6*100*100/120,0)>$F$3,$F$3,(ROUNDDOWN(T6*100*100/120,0)))","v":0},null,{"$f":"IF(ROUNDDOWN(V6*7,0)>$F$3,$F$3,(ROUNDDOWN(V6*7,0)))","v":0},{"$f":"W6+U6","v":0},{"$f":"E6/500*2","v":0},null,{"$f":"IF(F6=0,0,IF(Z6>Y6,P6,(Z6/Y6*F6)))","v":0},{"$f":"(F6/6)/3","v":0},null,{"$f":"IF(ROUNDDOWN(AC6*3*6,0)>$F$3,$F$3,(ROUNDDOWN(AC6*3*6,0)))","v":0},{"$f":"O6/25","v":0},null,{"$f":"IF(ROUNDDOWN(6*100/4*AF6,0)>$F$3,$F$3,(ROUNDDOWN(6*100/4*AF6,0)))","v":0},20000,{"$f":"IF(ROUNDDOWN(AH6/4,0)>$F$3,$F$3,(ROUNDDOWN(AH6/4,0)))","v":3000},null,{"$f":"A6","v":0},{"$f":"ROUNDDOWN(E6*10,0)","v":0},null,{"$f":"ROUNDDOWN(AM6/10,0)","v":0},{"$f":"ROUNDDOWN(E6*4,0)","v":0},{"$f":"'Randlängen-Rund'!D4","v":21991.148550000002},{"$f":"ROUNDDOWN(AP6/4,0)","v":5497},{"$f":"IF(AN6+AQ6>$F$3,$F$3,AN6+AQ6)","v":3000},{"$f":"IF(E6=0,\"\",ROUNDDOWN(E6/10+1,0))","v":""},null,{"$f":"IF(ROUNDDOWN(AT6*10,0)>$F$3,$F$3,ROUNDDOWN(AT6*10,0))","v":0},{"$f":"ROUNDDOWN(E6*2.5,0)","v":0},null,{"$f":"ROUNDDOWN(AW6/2.5,0)","v":0},{"$f":"E6","v":0},{"$f":"'Randlängen-Rund'!D26","v":18849.555900000003},{"$f":"AZ6/1","v":18849.555900000003},{"$f":"IF(AU6+AX6+BA6>$F$3,$F$3,AU6+AX6+BA6)","v":3000},{"$f":"IF(F6=0,0,Berechnungstabellen!K199)","v":0},{"$f":"IF($BC6=0,\"\",IF($E6>$BC6,$E6-$BC6,0))","v":""},{"$f":"IF(E6>BC6,(E6-BC6)/BC6,\"\")","v":""},{"$f":"IF($BC6=0,\"\",IF($F6>$BC6,$F6-$BC6,0))","v":""},{"$f":"IF(F6>BC6,(F6-BC6)/BC6,\"\")","v":""}]
[null,null,null,null,null,null,{"$f":"E7-F7","v":0},{"$f":"IF(F7=0,0,G7/(D$2-D7))","v":0},{"$f":"IF(E7=0,0,IF(F7=0,0,1-(F7/E7)))","v":0},{"$f":"IF(B7=0,0,IF(B7<\"2021\",4,3))","v":0},null,{"$f":"IF(B7=0,0,IF(K7>J7,0,$F$3))","v":0},null,null,0,{"$f":"IF(ROUNDDOWN(O7*$P$5,0)>$F$3,$F$3,(ROUNDDOWN(O7*$P$5,0)))","v":0},0,null,0,null,0,null,0,0,0,null,0,0,null,0,0,null,0,null,0,null,0,0,null,0,0,{"$f":"'Randlängen-Rund'!D5","v":0},0,0,"",null,0,{"$f":"ROUNDDOWN(E7*2.5,0)","v":0},null,0,0,{"$f":"'Randlängen-Rund'!D27","v":0},0,0,{"$f":"IF(F7=0,0,Berechnungstabellen!K200)","v":0},{"$f":"IF($BC7=0,\"\",IF($E7>$BC7,$E7-$BC7,0))","v":""},"",{"$f":"IF(BC7=0,\"\",IF(F7>BC7,F7-BC7,0))","v":""},""]
[null,null,null,null,null,null,0,0,0,0,null,{"$f":"IF(B8=0,0,IF(K8>J8,0,$F$3))","v":0},null,null,0,0,0,null,0,null,0,null,0,0,0,null,0,0,null,0,0,null,0,null,0,null,0,0,null,0,0,{"$f":"'Randlängen-Rund'!D6","v":0},0,0,"",null,0,0,null,0,0,{"$f":"'Randlängen-Rund'!D28","v":0},0,0,{"$f":"IF(F8=0,0,Berechnungstabellen!K201)","v":0},"","","",""]
[null,null,null,null,null,null,0,0,0,0,null,{"$f":"IF(B9=0,0,IF(K9>J9,0,$F$3))","v":0},null,null,0,0,0,null,0,null,0,null,0,0,0,null,0,0,null,0,0,null,0,null,0,null,0,0,null,0,0,{"$f":"'Randlängen-Rund'!D7","v":0},0,0,"",null,0,0,null,0,0,{"$f":"'Randlängen-Rund'!D29","v":0},0,0,{"$f":"IF(F9=0,0,Berechnungstabellen!K202)","v":0},"","","",""]
[null,null,null,null,null,null,0,0,0,0,null,0,null,null,0,0,0,null,0,null,0,null,0,0,0,null,0,0,null,0,0,null,0,null,0,null,0,0,null,0,0,{"$f":"'Randlängen-Rund'!D8","v":0},0,0,"",null,0,0,null,0,0,{"$f":"'Randlängen-Rund'!D30","v":0},0,0,{"$f":"IF(F10=0,0,Berechnungstabellen!K203)","v":0},"","","",""]
[null,null,null,null,null,null,0,0,0,0,null,{"$f":"IF(B11=0,0,IF(K11>J11,0,$F$3))","v":0},null,null,0,0,0,null,0,null,0,null,0,0,0,null,0,0,null,0,0,null,0,null,0,null,0,0,null,0,0,{"$f":"'Randlängen-Rund'!D9","v":0},0,0,"",null,0,0,null,0,0,{"$f":"'Randlängen-Rund'!D31","v":0},0,0,{"$f":"IF(F11=0,0,Berechnungstabellen!K204)","v":0},"","","",""]
[null,null,null,null,null,null,0,0,0,0,null,0,null,null,0,0,0,null,0,null,0,null,0,0,0,null,0,0,null,0,0,null,0,null,0,null,0,0,null,0,0,{"$f":"'Randlängen-Rund'!D10","v":0},0,0,"",null,0,0,null,0,0,{"$f":"'Randlängen-Rund'!D32","v":0},0,0,{"$f":"IF(F12=0,0,Berechnungstabellen!K205)","v":0},"","","",""]
[null,null,null,null,null,null,0,0,0,0,null,0,null,null,0,0,0,null,0,null,0,null,0,0,0,null,0,0,null,0,0,null,0,null,0,null,0,0,null,0,0,{"$f":"'Randlängen-Rund'!D11","v":0},0,0,"",null,0,0,null,0,0,{"$f":"'Randlängen-Rund'!D33","v":0},0,0,{"$f":"IF(F13=0,0,Berechnungstabellen!K206)","v":0},"","","",""]
[null,null,null,null,null,null,0,0,0,0,null,0,null,null,0,0,0,null,0,null,0,null,0,0,0,null,0,0,null,0,0,null,0,null,0,null,0,0,null,0,0,{"$f":"'Randlängen-Rund'!D12","v":0},0,0,"",null,0,0,null,0,0,{"$f":"'Randlängen-Rund'!D34","v":0},0,0,{"$f":"IF(F14=0,0,Berechnungstabellen!K207)","v":0},"","","",""]
[null,null,null,null,null,null,0,0,0,0,null,0,null,null,0,0,0,null,0,null,0,null,0,0,0,null,0,0,null,0,0,null,0,null,0,null,0,0,null,0,0,{"$f":"'Randlängen-Rund'!D13","v":0},0,0,"",null,0,0,null,0,0,{"$f":"'Randlängen-Rund'!D35","v":0},0,0,{"$f":"IF(F15=0,0,Berechnungstabellen!K208)","v":0},"","","",""]
[null,null,null,null,null,null,0,0,0,0,null,0,null,null,0,0,0,null,0,null,0,null,0,0,0,null,0,0,null,0,0,null,0,null,0,null,0,0,null,0,0,{"$f":"'Randlängen-Rund'!D14","v":0},0,0,"",null,0,0,null,0,0,{"$f":"'Randlängen-Rund'!D36","v":0},0,0,{"$f":"IF(F16=0,0,Berechnungstabellen!K209)","v":0},"","","",""]
[null,null,null,null,null,null,0,0,0,0,null,0,null,null,0,0,0,null,0,null,0,null,0,0,0,null,0,0,null,0,0,null,0,null,0,null,0,0,null,0,0,{"$f":"'Randlängen-Rund'!D15","v":0},0,0,"",null,0,0,null,0,0,{"$f":"'Randlängen-Rund'!D37","v":0},0,0,{"$f":"IF(F17=0,0,Berechnungstabellen!K210)","v":0},"","","",""]
[null,null,null,null,null,null,0,0,0,0,null,0,null,null,0,0,0,null,0,null,0,null,0,0,0,null,0,0,null,0,0,null,0,null,0,null,0,0,null,0,0,{"$f":"'Randlängen-Rund'!D16","v":0},0,0,"",null,0,0,null,0,0,{"$f":"'Randlängen-Rund'!D38","v":0},0,0,{"$f":"IF(F18=0,0,Berechnungstabellen!K211)","v":0},"","","",""]
[null,null,null,null,null,null,0,0,0,0,null,0,null,null,0,0,0,null,0,null,0,null,0,0,0,null,0,0,null,0,0,null,0,null,0,null,0,0,null,{"$f":"ROUNDDOWN(AM19/10,0)","v":0},0,{"$f":"'Randlängen-Rund'!D17","v":0},{"$f":"ROUNDDOWN(AP19/4,0)","v":0},0,"",null,0,0,null,{"$f":"ROUNDDOWN(AW19/2.5,0)","v":0},0,{"$f":"'Randlängen-Rund'!D39","v":0},{"$f":"AZ19/1","v":0},0,{"$f":"IF(F19=0,0,Berechnungstabellen!K212)","v":0},"","","",""]
[null,null,null,null,null,null,0,0,0,0,null,{"$f":"IF(B20=0,0,IF(K20>J20,0,$F$3))","v":0},null,null,0,0,0,null,0,null,0,null,0,0,0,null,0,0,null,0,0,null,0,null,0,null,0,0,null,0,0,{"$f":"'Randlängen-Rund'!D18","v":0},0,0,"",null,0,0,null,0,0,{"$f":"'Randlängen-Rund'!D40","v":0},0,0,{"$f":"IF(F20=0,0,Berechnungstabellen!K213)","v":0},"","","",""]
[null,null,null,null,null,null,0,0,0,0,null,0,null,null,0,0,0,null,0,null,0,null,0,0,0,null,0,0,null,0,0,null,0,null,0,null,0,0,null,0,0,{"$f":"'Randlängen-Rund'!D19","v":0},0,0,"",null,0,0,null,0,0,{"$f":"'Randlängen-Rund'!D41","v":0},0,0,{"$f":"IF(F21=0,0,Berechnungstabellen!K214)","v":0},"","","",""]
[null,null,null,null,null,null,0,0,0,0,null,0,null,null,0,0,0,null,0,null,0,null,0,0,0,null,0,0,null,0,0,null,0,null,0,null,0,0,null,0,0,{"$f":"'Randlängen-Rund'!D20","v":0},0,0,"",null,0,0,null,0,0,{"$f":"'Randlängen-Rund'!D42","v":0},0,0,{"$f":"IF(F22=0,0,Berechnungstabellen!K215)","v":0},"","","",""]
[null,null,null,null,"Summen:",null,"Summe:","Durchschnitt",null,null,null,null,null,null,null,null,null,null,null,null,null,null,null,null,null,null,null,null,null,null,null,null,null,null,null,null,null,null,null,null,null,null,null,null,null,null,null,null,null,null,null,null,null,null,{"$f":"SUMIF(BC6:BC22,\">0\")","v":0},{"$f":"SUM(BD6:BD22)","v":0},null,{"$f":"SUM(BF6:BF22)","v":0}]
[null,null,null,null,{"$f":"SUM(E6:E22)","v":0},{"$f":"SUM(F6:F22)","v":0},{"$f":"SUM(G6:G22)","v":0},{"$f":"IF(H6=0,0,AVERAGEIF(H6:H22,\"<>0\"))","v":0},{"$f":"IF(I6=0,0,AVERAGEIF(I6:I22,\"<>0\"))","v":0}]
[]
["Geprüfte Maßangaben:"]
[]
["Anmerkungen / ANG´s"]

{"sheet":"Junghennen-Bruderhähne","index":8,"n_rows":29,"n_cols":58,"rows_kept":29,"cut":false,"hidden":false,"merged":[[28,4,28,33],[23,7,23,8],[1,29,1,31],[13,29,13,31],[13,26,13,28],[26,2,26,33],[1,23,1,25]]}
["Ermittlung der maximalen Tierzahl, die gem. EU VO 2018/848 sowie 2020/464 Anhang I je Stall gehalten werden darf",null,null,null,null,null,null,null,null,null,null,null,null,null,null,null,null,null,null,null,null,null,null,null,null,null,null,null,null,null,null,null,null,null,null,null,null,null,null,null,null,null,null,null,null,null,null,null,null,null,null,null,null,null,null,null,null,"Junghennen - Bruderhähne"]
["Allg. Angaben",null,{"$f":"TODAY()","v":"2025-05-23"},"Belegung",null,null,null,"Tierverluste",null,null,null,null,"Stall",null,null,null,"Sitzstangen",null,null,"Sitzebenen",null,null,null,"Luken \n(Stall-AKB)",null,null,null,"Scharraumfläche",null,"Auslauföffnungen\n(AKB – Auslauf)",null,null,"Auslauf \n(bis 150 /350 m)",null,null,"Zusatzangaben: gem. TierSchNutztV (verpflichtend!)",null,null,null,null,null,null,null,"Info zur Sollermittlung: Bezugswert = Anzahl Tiere bei Einstallung",null,null,null,null,null,null,null,null,null,null,null,"Auswertung"]
[null,null,null,null,null,null,null,null,null,"Voliere Ebenen",null,null,"Warm-\nstall","Isolierte  Veranda","Ergebnis Stall",null,null,null,null,null,null,null,null,null,null,null,null,null,null,null,null,null,null,null,null,null,null,null,"Futter",null,null,null,null,null,null,null,null,"Tränken",null,null,null,null,null,null,"Überschreitung bei Einstallung",null,"Überschreitung aktuell"]
["Name\nStall (lt. Stall-plan)","Baujahr","Einstall-\ndatum","Tierzahl\nbei Ein-stallung","Belegung\nakt.","Durch-schnitts-gewicht aktuell","Gesamt (Anzahl Tiere)","Tiere je Tag","%","Ebenen max","Ebenen ist","Tiere Max.","m²","m²\njederzeit nutzbar\n","Summe \nm²","Kapa-\nzität\nTiere gem. Gewicht","soll m","ist\nm","Kapa-\nzität\n(Tier-zahl)","soll cm2","ist\ncm2","Kapa-\nzität\n(Tierzahl)","Kapa-\nzität Sitze gesamt\n(Tier-zahl)","soll m","ist\nm","Kapa-\nzität\n(Tier-zahl)","soll\nm²","ist\nm²","Kapa-\nzität\n(Tierzahl)","soll\nm","ist\nm","Kapa-\nzität\n(Tierzahl)","ist\nm²","Kapa-\nzität\n(Tier-zahl)",null,"Stall","Futtertröge Rinnen",null,null," Futtertröge Rund",null,null,"Futter-tröge ges.","Tränkeanzahl (Nippel)",null,null,"Rinnentränke",null,null,"Rundtränke",null,null,"Tränken ges.","Kapa-\nzität \nMin. aller Krite-\nrien \n","Anzahl Tiere","Einstal-lung\n%","Anzahl Tiere","aktuell %"]
["Feste Ställe",null,"max. Belegung je Stall:",null,10000,".",".",null,null,null,null,null,null,null,"max. kg / m²:",21,"mind. ",0.1,"m / Tier","mind. ",100,"cm2 / Tier",null,"mind. 2m/500 Tiere",null,null,"mind. ",0.33329999999999999," der notw. Fläche","mind. ",4,"m/100m²","mind. m²/Tier:",4,null,null,"soll (cm)","ist (cm)","Kapa-\nzität\n(Tierzahl)","soll (cm)","ist (cm)","Kapa-\nzität\n(Tierzahl)","Kapa-\nzität\n(Tierzahl)","soll","ist (Anzahl)","Kapa-\nzität\n(Tierzahl)","soll (cm)","ist (cm)","Kapa-\nzität\n(Tierzahl)","soll (cm)","ist (cm)","Kapa-\nzität\n(Tierzahl)","Summe Tränken"]
[null,null,null,null,null,null,{"$f":"D6-E6","v":0},{"$f":"IF(E6=0,0,G6/(C$2-C6))","v":0},{"$f":"IF(C6=0,0,IF(E6=0,0,1-(E6/D6)))","v":0},{"$f":"IF(B6=0,0,IF(B6<\"2021\",4,3))","v":0},null,{"$f":"IF(B6=0,0,IF(K6>J6,0,$E$5))","v":0},null,null,{"$f":"SUM(M6:N6)","v":0},{"$f":"IF(F6=0,0,IF(ROUNDDOWN(O6*P$5/F6,0)>$E$5,$E$5,(ROUNDDOWN(O6*P$5/F6,0))))","v":0},{"$f":"E6*$R$5","v":0},null,{"$f":"IF(ROUNDDOWN(R6/$R$5,0)>$E$5,$E$5,(ROUNDDOWN(R6/$R$5,0)))","v":0},{"$f":"$E6*$U$5","v":0},null,{"$f":"IF(ROUNDDOWN(U6/$U$5,0)>$E$5,$E$5,(ROUNDDOWN(U6/$U$5,0)))","v":0},{"$f":"S6+V6","v":0},{"$f":"D6/500*2","v":0},null,{"$f":"IF(E6=0,0,IF(Y6>X6,P6,(Y6/X6*D6)))","v":0},{"$f":"(E6/6)*$AB$5","v":0},null,{"$f":"IF(ROUNDDOWN(AB6*3*6,0)>$E$5,$E$5,(ROUNDDOWN(AB6*3*6,0)))","v":0},{"$f":"IF(P6=0,0,(E6*F6/$P$5/100*$AE$5))","v":0},null,{"$f":"IF(AE6>AD6,P6,IF(AD6=0,0,(AE6/AD6*E6)))","v":0},null,{"$f":"IF(ROUNDDOWN(AG6/$AH$5,0)>$E$5,$E$5,(ROUNDDOWN(AG6/$AH$5,0)))","v":0},null,{"$f":"A6","v":0},{"$f":"ROUNDDOWN(D6*10,0)","v":0},80000,{"$f":"ROUNDDOWN(AL6/10,0)","v":8000},{"$f":"ROUNDDOWN(D6*4,0)","v":0},{"$f":"'Randlängen-Rund'!I4","v":0},{"$f":"ROUNDDOWN(AO6/4,0)","v":0},{"$f":"IF(AM6+AP6>$E$5,$E$5,AM6+AP6)","v":8000},{"$f":"IF(D6=0,\"\",ROUNDDOWN(D6/10+1,0))","v":""},800,{"$f":"IF(ROUNDDOWN(AS6*10,0)>$E$5,$E$5,ROUNDDOWN(AS6*10,0))","v":8000},{"$f":"ROUNDDOWN(C6*2.5,0)","v":0},null,{"$f":"ROUNDDOWN(AV6/2.5,0)","v":0},{"$f":"D6","v":0},{"$f":"'Randlängen-Rund'!I26","v":0},{"$f":"AY6/1","v":0},{"$f":"IF(AT6+AW6+AZ6>$E$5,$E$5,AT6+AW6+AZ6)","v":8000},{"$f":"Berechnungstabellen!K220","v":0},{"$f":"IF($BB6=0,\"\",IF($D6>$BB6,$D6-$BB6,0))","v":""},{"$f":"IF(D6>BB6,(D6-BB6)/BB6,\"\")","v":""},{"$f":"IF($BB6=0,\"\",IF($E6>$BB6,$E6-$BB6,0))","v":""},{"$f":"IF(E6>BB6,(E6-BB6)/BB6,\"\")","v":""}]
[null,null,null,null,null,null,{"$f":"D7-E7","v":0},{"$f":"IF(E7=0,0,G7/(C$2-C7))","v":0},{"$f":"IF(C7=0,0,IF(E7=0,0,1-(E7/D7)))","v":0},{"$f":"IF(B7=0,0,IF(B7<\"2021\",4,3))","v":0},null,{"$f":"IF(B7=0,0,IF(K7>J7,0,$E$5))","v":0},null,null,0,0,0,null,0,{"$f":"$E7*$U$5","v":0},null,0,{"$f":"S7+V7","v":0},{"$f":"D7/500*2","v":0},null,{"$f":"IF(E7=0,0,IF(Y7>X7,P7,(Y7/X7*D7)))","v":0},0,null,0,0,null,0,null,0,null,0,0,null,0,0,{"$f":"'Randlängen-Rund'!I5","v":0},0,{"$f":"IF(AM7+AP7>$E$5,$E$5,AM7+AP7)","v":0},"",null,{"$f":"IF(ROUNDDOWN(AS7*10,0)>$E$5,$E$5,ROUNDDOWN(AS7*10,0))","v":0},{"$f":"ROUNDDOWN(C7*2.5,0)","v":0},null,0,0,{"$f":"'Randlängen-Rund'!I27","v":0},0,{"$f":"IF(AT7+AW7+AZ7>$E$5,$E$5,AT7+AW7+AZ7)","v":0},{"$f":"Berechnungstabellen!K221","v":0},"","",{"$f":"IF(BB7=0,\"\",IF(E7>BB7,E7-BB7,0))","v":""},""]
[null,null,null,null,null,null,0,0,0,0,null,0,null,null,0,0,0,null,0,0,null,0,0,0,null,0,0,null,0,0,null,0,null,0,null,0,0,null,0,0,{"$f":"'Randlängen-Rund'!I6","v":0},0,0,"",null,0,{"$f":"ROUNDDOWN(C8*2.5,0)","v":0},null,0,0,{"$f":"'Randlängen-Rund'!I28","v":0},0,0,{"$f":"Berechnungstabellen!K222","v":0},"","","",""]
[null,null,null,null,null,null,0,0,0,0,null,0,null,null,0,0,0,null,0,0,null,0,0,0,null,0,0,null,0,0,null,0,null,0,null,0,0,null,0,0,{"$f":"'Randlängen-Rund'!I7","v":0},0,0,"",null,0,0,null,0,0,{"$f":"'Randlängen-Rund'!I29","v":0},0,0,{"$f":"Berechnungstabellen!K223","v":0},"","","",""]
[null,null,null,null,null,null,0,0,0,0,null,0,null,null,0,0,0,null,0,0,null,0,0,0,null,0,0,null,0,0,null,{"$f":"IF(AE10>AD10,P10,IF(AD10=0,0,(AE10/AD10*E10)))","v":0},null,0,null,0,0,null,0,0,{"$f":"'Randlängen-Rund'!I8","v":0},0,0,"",null,0,0,null,0,0,{"$f":"'Randlängen-Rund'!I30","v":0},0,0,{"$f":"Berechnungstabellen!K224","v":0},"","","",""]
[null,null,null,null,null,null,0,0,0,0,null,0,null,null,0,0,0,null,0,0,null,0,0,0,null,0,0,null,0,0,null,{"$f":"IF(AE11>AD11,P11,IF(AD11=0,0,(AE11/AD11*E11)))","v":0},null,0,null,0,0,null,0,0,{"$f":"'Randlängen-Rund'!I9","v":0},0,0,"",null,0,0,null,0,0,{"$f":"'Randlängen-Rund'!I31","v":0},0,0,{"$f":"Berechnungstabellen!K225","v":0},"","","",""]
[null,null,null,null,null,null,0,0,0,0,null,0,null,null,0,0,0,null,0,0,null,0,0,0,null,0,0,null,0,0,null,0,null,0,null,0,0,null,0,0,{"$f":"'Randlängen-Rund'!I10","v":0},0,0,"",null,0,0,null,0,0,{"$f":"'Randlängen-Rund'!I32","v":0},0,0,{"$f":"Berechnungstabellen!K226","v":0},"","","",""]
[null,null,null,null,null,null,0,0,0,0,null,0,null,null,0,0,0,null,0,0,null,0,0,0,null,0,0,null,0,0,null,0,null,0,null,0,0,null,0,0,{"$f":"'Randlängen-Rund'!I11","v":0},0,0,"",null,0,0,null,0,0,{"$f":"'Randlängen-Rund'!I33","v":0},0,0,{"$f":"Berechnungstabellen!K227","v":0},"","","",""]
["Bewegl. Ställe",null,"max. Belegung je Stall:",null,10000,".",null,null,null,null,null,null,null,null,"max. kg / m²:",21,null,null,null,null,null,null,null,".",null,null,null,null,null,null,null,null,"mind. m²/Tier:",2.5]
[null,null,null,null,null,null,0,0,{"$f":"IF(C15=0,0,IF(E15=0,0,1-(E15/D15)))","v":0},{"$f":"IF(B15=0,0,IF(B15<\"2021\",4,3))","v":0},null,{"$f":"IF(B15=0,0,IF(K15>J15,0,$E$14))","v":0},null,null,{"$f":"SUM(M15:N15)","v":0},{"$f":"IF(F15=0,0,IF(ROUNDDOWN(O15*P$14/F15,0)>$E$14,$E$14,(ROUNDDOWN(O15*P$14/F15,0))))","v":0},{"$f":"E15*$R$5","v":0},null,{"$f":"IF(ROUNDDOWN(R15/$R$5,0)>$E$5,$E$5,(ROUNDDOWN(R15/$R$5,0)))","v":0},{"$f":"$E15*$U$5","v":0},null,{"$f":"IF(ROUNDDOWN(U15/$U$5,0)>$E$14,$E$14,(ROUNDDOWN(U15/$U$5,0)))","v":0},{"$f":"S15+V15","v":0},{"$f":"D15/500*2","v":0},null,{"$f":"IF(E15=0,0,IF(Y15>X15,P15,(Y15/X15*D15)))","v":0},{"$f":"(E15/6)*$AB$5","v":0},null,{"$f":"IF(ROUNDDOWN(AB15*3*6,0)>$E$14,$E$14,(ROUNDDOWN(AB15*3*6,0)))","v":0},{"$f":"IF(P15=0,0,(E15*F15/$P$5/100*$AE$5))","v":0},null,{"$f":"IF(AE15>AD15,P15,IF(AD15=0,0,(AE15/AD15*E15)))","v":0},null,{"$f":"IF(ROUNDDOWN(AG15/$AH$14,0)>$E$14,$E$14,(ROUNDDOWN(AG15/$AH$14,0)))","v":0},null,{"$f":"A15","v":0},{"$f":"ROUNDDOWN(D15*10,0)","v":0},null,0,{"$f":"ROUNDDOWN(D15*4,0)","v":0},{"$f":"'Randlängen-Rund'!I13","v":0},0,{"$f":"IF(AM15+AP15>$E$5,$E$5,AM15+AP15)","v":0},{"$f":"IF(D15=0,\"\",ROUNDDOWN(D15/10+1,0))","v":""},null,{"$f":"IF(ROUNDDOWN(AS15*10,0)>$E$5,$E$5,ROUNDDOWN(AS15*10,0))","v":0},{"$f":"ROUNDDOWN(C15*2.5,0)","v":0},null,0,{"$f":"D15","v":0},{"$f":"'Randlängen-Rund'!I35","v":0},0,{"$f":"IF(AT15+AW15+AZ15>$E$5,$E$5,AT15+AW15+AZ15)","v":0},{"$f":"Berechnungstabellen!K229","v":0},{"$f":"IF($BB15=0,\"\",IF($D15>$BB15,$D15-$BB15,0))","v":""},{"$f":"IF(D15>BB15,(D15-BB15)/BB15,\"\")","v":""},{"$f":"IF($BB15=0,\"\",IF($E15>$BB15,$E15-$BB15,0))","v":""},{"$f":"IF(E15>BB15,(E15-BB15)/BB15,\"\")","v":""}]
[null,null,null,null,null,null,0,0,{"$f":"IF(C16=0,0,IF(E16=0,0,1-(E16/D16)))","v":0},{"$f":"IF(B16=0,0,IF(B16<\"2021\",4,3))","v":0},null,{"$f":"IF(B16=0,0,IF(K16>J16,0,$E$14))","v":0},null,null,0,{"$f":"IF(F16=0,0,IF(ROUNDDOWN(O16*P$14/F16,0)>$E$14,$E$14,(ROUNDDOWN(O16*P$14/F16,0))))","v":0},0,null,0,{"$f":"$E16*$U$5","v":0},null,0,{"$f":"S16+V16","v":0},{"$f":"D16/500*2","v":0},null,{"$f":"IF(E16=0,0,IF(Y16>X16,P16,(Y16/X16*D16)))","v":0},0,null,0,0,null,0,null,{"$f":"IF(ROUNDDOWN(AG16/$AH$14,0)>$E$14,$E$14,(ROUNDDOWN(AG16/$AH$14,0)))","v":0},null,0,0,null,0,0,{"$f":"'Randlängen-Rund'!I14","v":0},0,{"$f":"IF(AM16+AP16>$E$5,$E$5,AM16+AP16)","v":0},"",null,{"$f":"IF(ROUNDDOWN(AS16*10,0)>$E$5,$E$5,ROUNDDOWN(AS16*10,0))","v":0},{"$f":"ROUNDDOWN(C16*2.5,0)","v":0},null,0,0,{"$f":"'Randlängen-Rund'!I36","v":0},0,{"$f":"IF(AT16+AW16+AZ16>$E$5,$E$5,AT16+AW16+AZ16)","v":0},{"$f":"Berechnungstabellen!K230","v":0},"","","",""]
[null,null,null,null,null,null,0,0,0,0,null,0,null,null,0,0,0,null,0,0,null,0,0,0,null,0,0,null,0,0,null,0,null,0,null,0,0,null,0,0,{"$f":"'Randlängen-Rund'!I15","v":0},0,0,"",null,0,{"$f":"ROUNDDOWN(C17*2.5,0)","v":0},null,0,0,{"$f":"'Randlängen-Rund'!I37","v":0},0,0,{"$f":"Berechnungstabellen!K231","v":0},"","","",""]
[null,null,null,null,null,null,0,0,0,0,null,0,null,null,0,0,0,null,0,0,null,0,0,0,null,0,0,null,0,0,null,0,null,0,null,0,0,null,0,0,{"$f":"'Randlängen-Rund'!I16","v":0},0,0,"",null,0,0,null,0,0,{"$f":"'Randlängen-Rund'!I38","v":0},0,0,{"$f":"Berechnungstabellen!K232","v":0},"","","",""]
[null,null,null,null,null,null,0,0,0,0,null,0,null,null,0,0,0,null,0,0,null,0,0,0,null,0,0,null,0,0,null,0,null,0,null,0,0,null,0,0,{"$f":"'Randlängen-Rund'!I17","v":0},0,0,"",null,0,0,null,0,0,{"$f":"'Randlängen-Rund'!I39","v":0},0,0,{"$f":"Berechnungstabellen!K233","v":0},"","","",""]
[null,null,null,null,null,null,0,0,0,0,null,0,null,null,0,0,0,null,0,0,null,0,0,0,null,0,0,null,0,0,null,0,null,0,null,0,0,null,0,0,{"$f":"'Randlängen-Rund'!I18","v":0},0,0,"",null,0,0,null,0,0,{"$f":"'Randlängen-Rund'!I40","v":0},0,0,{"$f":"Berechnungstabellen!K234","v":0},"","","",""]
[null,null,null,null,null,null,0,0,0,0,null,0,null,null,0,0,0,null,0,0,null,0,0,0,null,0,0,null,0,0,null,0,null,0,null,0,0,null,0,0,{"$f":"'Randlängen-Rund'!I19","v":0},0,0,"",null,0,0,null,0,0,{"$f":"'Randlängen-Rund'!I41","v":0},0,0,{"$f":"Berechnungstabellen!K235","v":0},"","","",""]
[null,null,null,null,null,null,0,0,0,0,null,0,null,null,0,0,0,null,0,{"$f":"$E22*$U$5","v":0},null,0,0,0,null,0,0,null,0,0,null,0,null,0,null,0,0,null,0,0,{"$f":"'Randlängen-Rund'!I20","v":0},0,0,"",null,0,0,null,0,0,{"$f":"'Randlängen-Rund'!I42","v":0},0,0,{"$f":"Berechnungstabellen!K236","v":0},"","","",""]
[null,null,null,null,null,null,0,0,0,{"$f":"IF(B23=0,0,IF(B23<\"2021\",4,3))","v":0},null,0,null,null,0,0,0,null,0,0,null,0,0,{"$f":"D23/500*2","v":0},null,0,0,null,0,0,null,0,null,0,null,0,0,null,0,0,{"$f":"'Randlängen-Rund'!I21","v":0},0,{"$f":"IF(AM23+AP23>$E$5,$E$5,AM23+AP23)","v":0},"",null,0,{"$f":"ROUNDDOWN(C23*2.5,0)","v":0},null,0,0,{"$f":"'Randlängen-Rund'!I43","v":0},0,0,{"$f":"Berechnungstabellen!K237","v":0},"",{"$f":"IF(D23>BB23,(D23-BB23)/BB23,\"\")","v":""},{"$f":"IF($BB23=0,\"\",IF($E23>$BB23,$E23-$BB23,0))","v":""},{"$f":"IF(E23>BB23,(E23-BB23)/BB23,\"\")","v":""}]
[null,null,null,"Summen:",null,null,"Summe:","Durchschnitt",null,null,null,null,null,null,null,null,null,null,null,null,null,null,null,null,null,null,null,null,null,null,null,null,null,null,null,null,null,null,null,null,null,null,null,null,null,null,null,null,null,null,null,null,null,{"$f":"SUMIF(BB6:BB23,\">0\")","v":0}]
[null,null,null,{"$f":"SUM(D6:D23)","v":0},{"$f":"SUM(E6:E23)-E14","v":0},null,{"$f":"SUM(G6:G23)","v":0},{"$f":"IF(H6=0,0,AVERAGEIF(H6:H23,\"<>0\"))","v":0},{"$f":"IF(I6=0,0,AVERAGEIF(I6:I23,\"<>0\"))","v":0}]
[]
["Geprüfte Maßangaben:",null,"asdflsadjflas \nasjfldjsf"]
[]
["Anmerkungen / Kommentare"]

{"sheet":"Masthähnchen","index":9,"n_rows":48,"n_cols":58,"rows_kept":48,"cut":false,"hidden":false,"merged":[[47,4,47,33],[4,0,4,1],[13,0,13,1],[24,0,24,1],[35,0,35,1],[45,13,45,33],[1,29,1,31],[24,29,24,31],[24,26,24,28],[35,26,35,28],[35,29,35,31],[13,26,13,28],[13,29,13,31]]}
["Ermittlung der maximalen Tierzahl, die gem. EU VO 2018/848 sowie 2020/464 Anhang I je Stall gehalten werden darf",null,null,null,null,null,null,null,null,null,null,null,null,null,null,null,null,null,null,null,null,null,null,null,null,null,null,null,null,null,null,null,null,null,null,null,null,null,null,null,null,null,null,null,null,null,null,null,null,null,null,null,null,null,null,null,null,"Mastgeflügel"]
[null,null,{"$f":"TODAY()","v":"2025-05-23"},"Belegung",null,null,null,"Tierverluste",null,null,null,null,"Stall",null,null,null,null,"Sitzstangen ",null,null,"Sitzebenen",null,null,null,"Luken \n(Stall-KSR)",null,null,"Scharraumfläche",null,"Auslauföffnungen\n(KSR – Auslauf)",null,null,"Auslauf \n(bis 150 /350 m)",null,null,"Zusatzangaben: gem. TierSchNutztV (verpflichtend!)",null,null,null,null,null,null,null,"Info zur Sollermittlung: Bezugswert = Anzahl Tiere bei Einstallung",null,null,null,null,null,null,null,null,null,null,null,"Auswertung"]
[null,null,null,null,null,null,null,null,null,"Voliere Ebenen",null,null,"Warm-\nstall","Isolierte  Veranda","Ergebnis Stall",null,null,null,null,null,null,null,null,null,null,null,null,null,null,null,null,null,null,null,null,null,null,"Futter",null,null,null,null,null,null,null,null,null,"Tränken",null,null,null,null,null,null,"Überschreitung bei Einstallung",null,"Überschreitung aktuell"]
["Name\nStall (lt. Stall-plan)","Baujahr","Einstall-\ndatum","Tierzahl\nbei Ein-stallung","Belegung\nakt.","Durch-schnitts-gewicht aktuell","Gesamt (Anzahl Tiere)","Tiere je Tag","%","Ebenen max","Ebenen ist","Tiere Max.","m²","m²\njederzeit nutzbar\n","Summe \nm²","Kapa-\nzität\nTiere gem. Gewicht","soll m","ist\nm","Kapa-\nzität\n(Tier-zahl)","soll cm2","ist\ncm2","Kapa-\nzität\n(Tier-zahl)","Kapa-\nzität Sitze gesamt\n(Tier-zahl)","soll m","ist\nm","Kapa-\nzität\n(Tier-zahl)","soll\nm²","ist\nm²","Kapa-\nzität\n(Tier-zahl)","soll\nm","ist\nm","Kapa-\nzität\n(Tier-zahl)","ist\nm²","Kapa-\nzität\n(Tier-zahl)",null,"Stall","Futtertröge Rinnen",null,null," Futtertröge Rund",null,null,"Futter-tröge ges.","Tränkeanzahl (Nippel)",null,null,"Rinnentränke",null,null,"Rundtränke",null,null,"Tränken ges.","Kapa-\nzität \nMin. aller Krite-\nrien \n","Anzahl Tiere","Einstal-lung\n%","Anzahl Tiere","aktuell %"]
["Gallus gallus Stall fest",null,"max. Belegung je Stall:",null,4800,".",".",null,null,null,null,null,null,null,"max. kg / m²:",21,"mind. ",0.05,"m / Tier","mind. ",25,"cm2 / Tier",null,"mind. 2m/500 Tiere",null,null,"mind. ",0.33329999999999999," der notw. Fläche","mind. ",4,"m/100m²","mind. m²/Tier:",4,null,null,"soll (cm)","ist (cm)","Kapa-\nzität\n(Tierzahl)","soll (cm)","ist (cm)","Kapa-\nzität\n(Tierzahl)","Kapa-\nzität\n(Tierzahl)","soll","ist (Anzahl)","Kapa-\nzität\n(Tierzahl)","soll (cm)","ist (cm)","Kapa-\nzität\n(Tierzahl)","soll (cm)","ist (cm)","Kapa-\nzität\n(Tierzahl)","Summe Tränken"]
[null,null,null,null,null,null,{"$f":"D6-E6","v":0},{"$f":"IF(E6=0,0,G6/(C$2-C6))","v":0},{"$f":"IF(C6=0,0,IF(E6=0,0,1-(E6/D6)))","v":0},{"$f":"IF(B6=0,0,IF(B6<\"2021\",4,3))","v":0},null,{"$f":"IF(B6=0,0,IF(K6>J6,0,$E$5))","v":0},null,null,{"$f":"SUM(M6:N6)","v":0},{"$f":"IF(F6=0,0,IF(ROUNDDOWN(O6*P$5/F6,0)>$E$5,$E$5,(ROUNDDOWN(O6*P$5/F6,0))))","v":0},{"$f":"E6*$R$5","v":0},null,{"$f":"IF(ROUNDDOWN(R6/$R$5,0)>$E$5,$E$5,(ROUNDDOWN(R6/$R$5,0)))","v":0},{"$f":"$E6*$U$5","v":0},null,{"$f":"IF(ROUNDDOWN(U6/$U$5,0)>$E$5,$E$5,(ROUNDDOWN(U6/$U$5,0)))","v":0},{"$f":"S6+V6","v":0},{"$f":"D6/500*2","v":0},null,{"$f":"IF(E6=0,0,IF(Y6>X6,P6,(Y6/X6*E6)))","v":0},{"$f":"(E6/6)*$AB$5","v":0},null,{"$f":"IF(ROUNDDOWN(AB6*3*6,0)>$E$5,$E$5,(ROUNDDOWN(AB6*3*6,0)))","v":0},{"$f":"IF(P6=0,0,(E6*F6/$P$5/100*$AE$5))","v":0},null,{"$f":"IF(AE6>AD6,P6,IF(AD6=0,0,(AE6/AD6*E6)))","v":0},null,{"$f":"IF(ROUNDDOWN(AG6/$AH$5,0)>$E$5,$E$5,(ROUNDDOWN(AG6/$AH$5,0)))","v":0},null,{"$f":"A6","v":0},{"$f":"ROUNDDOWN(D6*10,0)","v":0},null,{"$f":"ROUNDDOWN(AL6/10,0)","v":0},{"$f":"ROUNDDOWN(D6*4,0)","v":0},{"$f":"'Randlängen-Rund'!N4","v":0},{"$f":"ROUNDDOWN(AO6/4,0)","v":0},{"$f":"IF((AM6+AP6)>$E$5,$E$5,AM6+AP6)","v":0},{"$f":"IF(D6=0,\"\",ROUNDDOWN(D6/10+1,0))","v":""},null,{"$f":"IF(ROUNDDOWN(AS6*10,0)>$E$5,$E$5,ROUNDDOWN(AS6*10,0))","v":0},{"$f":"ROUNDDOWN(D6*2.5,0)","v":0},null,{"$f":"ROUNDDOWN(AV6/2.5,0)","v":0},{"$f":"D6","v":0},{"$f":"'Randlängen-Rund'!N26","v":0},{"$f":"AY6/1","v":0},{"$f":"IF((AT6+AW6+AZ6)>$E$5,$E$5,AT6+AW6+AZ6)","v":0},{"$f":"Berechnungstabellen!K241","v":0},{"$f":"IF($BB6=0,\"\",IF($D6>$BB6,$D6-$BB6,0))","v":""},{"$f":"IF(D6>BB6,(D6-BB6)/BB6,\"\")","v":""},{"$f":"IF($BB6=0,\"\",IF($E6>$BB6,$E6-$BB6,0))","v":""},{"$f":"IF(E6>BB6,(E6-BB6)/BB6,\"\")","v":""}]
[null,null,null,null,null,null,{"$f":"D7-E7","v":0},{"$f":"IF(E7=0,0,G7/(C$2-C7))","v":0},{"$f":"IF(C7=0,0,IF(E7=0,0,1-(E7/D7)))","v":0},{"$f":"IF(B7=0,0,IF(B7<\"2021\",4,3))","v":0},null,{"$f":"IF(B7=0,0,IF(K7>J7,0,$E$5))","v":0},null,null,0,{"$f":"IF(F7=0,0,IF(ROUNDDOWN(O7*P$5/F7,0)>$E$5,$E$5,(ROUNDDOWN(O7*P$5/F7,0))))","v":0},0,null,0,{"$f":"$E7*$U$5","v":0},null,0,{"$f":"S7+V7","v":0},0,null,{"$f":"IF(E7=0,0,IF(Y7>X7,P7,(Y7/X7*E7)))","v":0},0,null,0,0,null,0,null,0,null,0,0,null,0,0,{"$f":"'Randlängen-Rund'!N5","v":0},0,{"$f":"IF((AM7+AP7)>$E$5,$E$5,AM7+AP7)","v":0},"",null,{"$f":"IF(ROUNDDOWN(AS7*10,0)>$E$5,$E$5,ROUNDDOWN(AS7*10,0))","v":0},{"$f":"ROUNDDOWN(D7*2.5,0)","v":0},null,0,0,{"$f":"'Randlängen-Rund'!N27","v":0},0,{"$f":"IF((AT7+AW7+AZ7)>$E$5,$E$5,AT7+AW7+AZ7)","v":0},{"$f":"Berechnungstabellen!K242","v":0},"","",{"$f":"IF(BB7=0,\"\",IF(E7>BB7,E7-BB7,0))","v":""},""]
[null,null,null,null,null,null,0,0,0,0,null,0,null,null,0,0,0,null,0,0,null,0,0,0,null,0,0,null,0,0,null,0,null,0,null,0,0,null,0,0,{"$f":"'Randlängen-Rund'!N6","v":0},0,0,"",null,0,{"$f":"ROUNDDOWN(D8*2.5,0)","v":0},null,0,0,{"$f":"'Randlängen-Rund'!N28","v":0},0,0,{"$f":"Berechnungstabellen!K243","v":0},"","","",""]
[null,null,null,null,null,null,0,0,0,0,null,0,null,null,0,0,0,null,0,0,null,0,0,0,null,0,0,null,0,0,null,0,null,0,null,0,0,null,0,0,{"$f":"'Randlängen-Rund'!N7","v":0},0,0,"",null,0,0,null,0,0,{"$f":"'Randlängen-Rund'!N29","v":0},0,0,{"$f":"Berechnungstabellen!K244","v":0},"","","",""]
[null,null,null,null,null,null,0,0,0,0,null,0,null,null,0,0,0,null,0,0,null,0,0,0,null,0,0,null,0,0,null,{"$f":"IF(AE10>AD10,P10,IF(AD10=0,0,(AE10/AD10*E10)))","v":0},null,0,null,0,0,null,0,0,{"$f":"'Randlängen-Rund'!N8","v":0},0,0,"",null,0,0,null,0,0,{"$f":"'Randlängen-Rund'!N30","v":0},0,0,{"$f":"Berechnungstabellen!K245","v":0},"","","",""]
[null,null,null,null,null,null,0,0,0,0,null,0,null,null,0,0,0,null,0,0,null,0,0,0,null,0,0,null,0,0,null,{"$f":"IF(AE11>AD11,P11,IF(AD11=0,0,(AE11/AD11*E11)))","v":0},null,0,null,0,0,null,0,0,{"$f":"'Randlängen-Rund'!N9","v":0},0,0,"",null,0,0,null,0,0,{"$f":"'Randlängen-Rund'!N31","v":0},0,0,{"$f":"Berechnungstabellen!K246","v":0},"","","",""]
[null,null,null,null,null,null,0,0,0,0,null,0,null,null,0,0,0,null,0,0,null,0,0,0,null,0,0,null,0,0,null,0,null,0,null,0,0,null,0,0,{"$f":"'Randlängen-Rund'!N10","v":0},0,0,"",null,0,0,null,0,0,{"$f":"'Randlängen-Rund'!N32","v":0},0,0,{"$f":"Berechnungstabellen!K247","v":0},"","","",""]
[null,null,null,null,null,null,0,0,0,0,null,0,null,null,0,0,0,null,0,0,null,0,0,0,null,0,0,null,0,0,null,0,null,0,null,0,0,null,0,0,{"$f":"'Randlängen-Rund'!N11","v":0},0,0,"",null,0,0,null,0,0,{"$f":"'Randlängen-Rund'!N33","v":0},0,0,{"$f":"Berechnungstabellen!K248","v":0},"","","",""]
["Bewegl. Ställe",null,"max. Belegung je Stall:",null,4800,".",null,null,null,null,null,null,null,null,"max. kg / m²:",21,null,null,null,null,null,null,null,".",null,null,null,null,null,null,null,null,"mind. m²/Tier:",2.5]
[null,null,null,null,null,null,{"$f":"D15-E15","v":0},{"$f":"IF(E15=0,0,G15/(C$2-C15))","v":0},{"$f":"IF(C15=0,0,IF(E15=0,0,1-(E15/D15)))","v":0},{"$f":"IF(B15=0,0,IF(B15<\"2021\",4,3))","v":0},null,{"$f":"IF(B15=0,0,IF(K15>J15,0,$E$14))","v":0},null,null,{"$f":"SUM(M15:N15)","v":0},{"$f":"IF(F15=0,0,IF(ROUNDDOWN(O15*P$14/F15,0)>$E$14,$E$14,(ROUNDDOWN(O15*P$14/F15,0))))","v":0},{"$f":"E15*$R$5","v":0},null,{"$f":"IF(ROUNDDOWN(R15/$R$5,0)>$E$5,$E$5,(ROUNDDOWN(R15/$R$5,0)))","v":0},{"$f":"$E15*$U$5","v":0},null,{"$f":"IF(ROUNDDOWN(U15/$U$5,0)>$E$14,$E$14,(ROUNDDOWN(U15/$U$5,0)))","v":0},{"$f":"S15+V15","v":0},{"$f":"D15/500*2","v":0},null,{"$f":"IF(E15=0,0,IF(Y15>X15,S15,(Y15/X15*E15)))","v":0},{"$f":"(E15/6)*$AB$5","v":0},null,{"$f":"IF(ROUNDDOWN(AB15*3*6,0)>$E$14,$E$14,(ROUNDDOWN(AB15*3*6,0)))","v":0},{"$f":"IF(P15=0,0,(E15*F15/$P$5/100*$AE$5))","v":0},null,{"$f":"IF(AE15>AD15,P15,IF(AD15=0,0,(AE15/AD15*E15)))","v":0},null,{"$f":"IF(ROUNDDOWN(AG15/$AH$14,0)>$E$14,$E$14,(ROUNDDOWN(AG15/$AH$14,0)))","v":0},null,{"$f":"A15","v":0},{"$f":"ROUNDDOWN(D15*10,0)","v":0},null,{"$f":"ROUNDDOWN(AL15/10,0)","v":0},{"$f":"ROUNDDOWN(D15*4,0)","v":0},{"$f":"'Randlängen-Rund'!N13","v":0},{"$f":"ROUNDDOWN(AO15/4,0)","v":0},{"$f":"IF((AM15+AP15)>$E$14,$E$14,AM15+AP15)","v":0},{"$f":"IF(D15=0,\"\",ROUNDDOWN(D15/10+1,0))","v":""},null,{"$f":"IF(ROUNDDOWN(AS15*10,0)>$E$5,$E$5,ROUNDDOWN(AS15*10,0))","v":0},{"$f":"ROUNDDOWN(D15*2.5,0)","v":0},null,{"$f":"ROUNDDOWN(AV15/2.5,0)","v":0},{"$f":"D15","v":0},{"$f":"'Randlängen-Rund'!N35","v":0},{"$f":"AY15/1","v":0},{"$f":"IF((AT15+AW15+AZ15)>$E$14,$E$14,AT15+AW15+AZ15)","v":0},{"$f":"Berechnungstabellen!K250","v":0},{"$f":"IF($BB15=0,\"\",IF($D15>$BB15,$D15-$BB15,0))","v":""},{"$f":"IF(D15>BB15,(D15-BB15)/BB15,\"\")","v":""},{"$f":"IF($BB15=0,\"\",IF($E15>$BB15,$E15-$BB15,0))","v":""},{"$f":"IF(E15>BB15,(E15-BB15)/BB15,\"\")","v":""}]
[null,null,null,null,null,null,0,0,{"$f":"IF(C16=0,0,IF(E16=0,0,1-(E16/D16)))","v":0},{"$f":"IF(B16=0,0,IF(B16<\"2021\",4,3))","v":0},null,{"$f":"IF(B16=0,0,IF(K16>J16,0,$E$14))","v":0},null,null,0,{"$f":"IF(F16=0,0,IF(ROUNDDOWN(O16*P$14/F16,0)>$E$14,$E$14,(ROUNDDOWN(O16*P$14/F16,0))))","v":0},0,null,0,{"$f":"$E16*$U$5","v":0},null,0,{"$f":"S16+V16","v":0},0,null,{"$f":"IF(E16=0,0,IF(Y16>X16,S16,(Y16/X16*E16)))","v":0},0,null,0,0,null,0,null,{"$f":"IF(ROUNDDOWN(AG16/$AH$14,0)>$E$14,$E$14,(ROUNDDOWN(AG16/$AH$14,0)))","v":0},null,0,0,null,0,0,{"$f":"'Randlängen-Rund'!N14","v":0},0,0,"",null,{"$f":"IF(ROUNDDOWN(AS16*10,0)>$E$5,$E$5,ROUNDDOWN(AS16*10,0))","v":0},{"$f":"ROUNDDOWN(D16*2.5,0)","v":0},null,0,0,{"$f":"'Randlängen-Rund'!N36","v":0},0,{"$f":"IF((AT16+AW16+AZ16)>$E$14,$E$14,AT16+AW16+AZ16)","v":0},{"$f":"Berechnungstabellen!K251","v":0},"","",{"$f":"IF(BB16=0,\"\",IF(E16>BB16,E16-BB16,0))","v":""},""]
[null,null,null,null,null,null,0,0,0,0,null,0,null,null,0,0,0,null,0,0,null,0,0,0,null,0,0,null,0,0,null,0,null,0,null,0,0,null,0,0,{"$f":"'Randlängen-Rund'!N15","v":0},0,0,"",null,0,{"$f":"ROUNDDOWN(D17*2.5,0)","v":0},null,0,0,{"$f":"'Randlängen-Rund'!N37","v":0},0,0,{"$f":"Berechnungstabellen!K252","v":0},"","","",""]
[null,null,null,null,null,null,0,0,0,0,null,0,null,null,0,0,0,null,0,0,null,0,0,0,null,0,0,null,0,0,null,0,null,0,null,0,0,null,0,0,{"$f":"'Randlängen-Rund'!N16","v":0},0,0,"",null,0,0,null,0,0,{"$f":"'Randlängen-Rund'!N38","v":0},0,0,{"$f":"Berechnungstabellen!K253","v":0},"","","",""]
[null,null,null,null,null,null,0,0,0,0,null,0,null,null,0,0,0,null,0,0,null,0,0,0,null,0,0,null,0,0,null,0,null,0,null,0,0,null,0,0,{"$f":"'Randlängen-Rund'!N17","v":0},0,0,"",null,0,0,null,0,0,{"$f":"'Randlängen-Rund'!N39","v":0},0,0,{"$f":"Berechnungstabellen!K254","v":0},"","","",""]
[null,null,null,null,null,null,0,0,0,0,null,0,null,null,0,0,0,null,0,0,null,0,0,0,null,0,0,null,0,0,null,0,null,0,null,0,0,null,0,0,{"$f":"'Randlängen-Rund'!N18","v":0},0,0,"",null,0,0,null,0,0,{"$f":"'Randlängen-Rund'!N40","v":0},0,0,{"$f":"Berechnungstabellen!K255","v":0},"","","",""]
[null,null,null,null,null,null,0,0,0,0,null,0,null,null,0,0,0,null,0,{"$f":"$E21*$U$5","v":0},null,0,0,0,null,0,0,null,0,0,null,0,null,0,null,0,0,null,0,0,{"$f":"'Randlängen-Rund'!N19","v":0},0,0,"",null,0,0,null,0,0,{"$f":"'Randlängen-Rund'!N41","v":0},0,0,{"$f":"Berechnungstabellen!K256","v":0},"","","",""]
[null,null,null,null,null,null,0,0,0,0,null,0,null,null,0,0,0,null,0,0,null,0,0,0,null,0,0,null,0,0,null,0,null,0,null,0,0,null,0,0,{"$f":"'Randlängen-Rund'!N20","v":0},0,0,"",null,0,0,null,0,0,{"$f":"'Randlängen-Rund'!N42","v":0},0,0,{"$f":"Berechnungstabellen!K257","v":0},"","","",""]
[null,null,null,"Summen:",null,null,"Summe:","Durchschnitt"]
[null,null,null,{"$f":"SUM(D6:D22)","v":0},{"$f":"SUM(E6:E22)-E14","v":0},null,{"$f":"SUM(G6:G22)","v":0},{"$f":"IF(H6=0,0,AVERAGEIF(H6:H22,\"<>0\"))","v":0},{"$f":"IF(I6=0,0,AVERAGEIF(I6:I22,\"<>0\"))","v":0}]
["Kapaune",null,"max. Belegung je Stall:",null,2500,null,null,null,null,null,null,null,null,null,"max. kg / m²:",21,null,null,null,null,null,null,null,".",null,null,null,null,null,null,null,null,"mind. m²/Tier:",2.5,null,null,null,null,null,null,null,null,null,null,null,null,null,null,null,null,null,null,null,null,null,null,null,{"$f":"A25","v":"Kapaune"}]
[null,null,null,null,null,null,0,0,{"$f":"IF(C26=0,0,IF(E26=0,0,1-(E26/D26)))","v":0},{"$f":"IF(B26=0,0,IF(B26<\"2021\",4,3))","v":0},null,{"$f":"IF(B26=0,0,IF(K26>J26,0,$E$25))","v":0},null,null,{"$f":"SUM(M26:N26)","v":0},{"$f":"IF(F26=0,0,IF(ROUNDDOWN(O26*P$25/F26,0)>$E$25,$E$25,(ROUNDDOWN(O26*P$25/F26,0))))","v":0},{"$f":"E26*$R$5","v":0},null,{"$f":"IF(ROUNDDOWN(R26/$R$5,0)>$E$5,$E$5,(ROUNDDOWN(R26/$R$5,0)))","v":0},{"$f":"$E26*$U$5","v":0},null,{"$f":"IF(ROUNDDOWN(U26/$U$5,0)>$E$25,$E$25,(ROUNDDOWN(U26/$U$5,0)))","v":0},{"$f":"S26+V26","v":0},{"$f":"E26/500*2","v":0},null,{"$f":"IF(E26=0,0,IF(Y26>X26,S26,(Y26/X26*E26)))","v":0},{"$f":"(E26/6)*$AB$5","v":0},null,{"$f":"IF(ROUNDDOWN(AB26*3*6,0)>$E$25,$E$25,(ROUNDDOWN(AB26*3*6,0)))","v":0},{"$f":"IF(P26=0,0,(O26/P26*E26/100*$AE$5))","v":0},null,{"$f":"IF(AE26>AD26,P26,IF(AD26=0,0,(AE26/AD26*E26)))","v":0},null,{"$f":"IF(ROUNDDOWN(AG26/$AH$25,0)>$E$25,$E$25,(ROUNDDOWN(AG26/$AH$25,0)))","v":0},null,{"$f":"A26","v":0},{"$f":"ROUNDDOWN(D26*10,0)","v":0},null,0,{"$f":"ROUNDDOWN(D26*4,0)","v":0},{"$f":"'Randlängen-Rund'!S4","v":0},0,{"$f":"IF((AM26+AP26)>$E$25,$E$25,AM26+AP26)","v":0},{"$f":"IF(D26=0,\"\",ROUNDDOWN(D26/10+1,0))","v":""},null,{"$f":"IF(ROUNDDOWN(AS26*10,0)>$E$25,$E$25,ROUNDDOWN(AS26*10,0))","v":0},{"$f":"ROUNDDOWN(D26*2.5,0)","v":0},null,{"$f":"ROUNDDOWN(AV26/2.5,0)","v":0},{"$f":"D26","v":0},{"$f":"'Randlängen-Rund'!N46","v":0},{"$f":"AY26/1","v":0},{"$f":"IF((AT26+AW26+AZ26)>$E$25,$E$25,AT26+AW26+AZ26)","v":0},{"$f":"Berechnungstabellen!K261","v":0},{"$f":"IF($BB26=0,\"\",IF($D26>$BB26,$D26-$BB26,0))","v":""},{"$f":"IF(D26>BB26,(D26-BB26)/BB26,\"\")","v":""},{"$f":"IF($BB26=0,\"\",IF($E26>$BB26,$E26-$BB26,0))","v":""},{"$f":"IF(E26>BB26,(E26-BB26)/BB26,\"\")","v":""}]
[null,null,null,null,null,null,0,0,{"$f":"IF(C27=0,0,IF(E27=0,0,1-(E27/D27)))","v":0},{"$f":"IF(B27=0,0,IF(B27<\"2021\",4,3))","v":0},null,{"$f":"IF(B27=0,0,IF(K27>J27,0,$E$25))","v":0},null,null,0,0,0,null,0,{"$f":"$E27*$U$5","v":0},null,0,{"$f":"S27+V27","v":0},0,null,{"$f":"IF(E27=0,0,IF(Y27>X27,S27,(Y27/X27*E27)))","v":0},0,null,0,0,null,0,null,0,null,0,0,null,0,0,{"$f":"'Randlängen-Rund'!S5","v":0},0,0,"",null,0,{"$f":"ROUNDDOWN(D27*2.5,0)","v":0},null,0,0,{"$f":"'Randlängen-Rund'!N47","v":0},0,0,{"$f":"Berechnungstabellen!K262","v":0},"","",{"$f":"IF(BB27=0,\"\",IF(E27>BB27,E27-BB27,0))","v":""},""]
[null,null,null,null,null,null,0,0,0,0,null,0,null,null,0,0,0,null,0,0,null,0,0,0,null,0,0,null,0,0,null,0,null,0,null,0,0,null,0,0,{"$f":"'Randlängen-Rund'!S6","v":0},0,0,"",null,0,{"$f":"ROUNDDOWN(D28*2.5,0)","v":0},null,0,0,{"$f":"'Randlängen-Rund'!N48","v":0},0,0,{"$f":"Berechnungstabellen!K263","v":0},"","","",""]
[null,null,null,null,null,null,0,0,0,0,null,0,null,null,0,0,0,null,0,0,null,0,0,0,null,0,0,null,0,0,null,0,null,0,null,0,0,null,0,0,{"$f":"'Randlängen-Rund'!S7","v":0},0,0,"",null,0,0,null,0,0,{"$f":"'Randlängen-Rund'!N49","v":0},0,0,{"$f":"Berechnungstabellen!K264","v":0},"","","",""]
[null,null,null,null,null,null,0,0,0,0,null,0,null,null,0,0,0,null,0,0,null,0,0,0,null,0,0,null,0,{"$f":"IF(P30=0,0,(O30/P30*E30/100*$AE$5))","v":0},null,0,null,0,null,0,0,null,0,0,{"$f":"'Randlängen-Rund'!S8","v":0},0,0,"",null,0,0,null,0,0,{"$f":"'Randlängen-Rund'!N50","v":0},0,0,{"$f":"Berechnungstabellen!K265","v":0},"","","",""]
[null,null,null,null,null,null,0,0,0,0,null,0,null,null,0,0,0,null,0,0,null,0,0,0,null,0,0,null,0,0,null,0,null,0,null,0,0,null,0,0,{"$f":"'Randlängen-Rund'!S9","v":0},0,0,"",null,0,0,null,0,0,{"$f":"'Randlängen-Rund'!N51","v":0},0,0,{"$f":"Berechnungstabellen!K266","v":0},"","","",""]
[null,null,null,null,null,null,0,0,0,0,null,0,null,null,0,0,0,null,0,{"$f":"$E32*$U$5","v":0},null,0,0,0,null,0,0,null,0,0,null,0,null,0,null,0,0,null,0,0,{"$f":"'Randlängen-Rund'!S10","v":0},0,0,"",null,0,0,null,0,0,{"$f":"'Randlängen-Rund'!N52","v":0},0,0,{"$f":"Berechnungstabellen!K267","v":0},"","","",""]
[null,null,null,null,null,null,0,0,0,0,null,0,null,null,0,0,0,null,0,0,null,0,0,0,null,0,0,null,0,0,null,0,null,0,null,0,0,null,0,0,{"$f":"'Randlängen-Rund'!S11","v":0},0,0,"",null,0,0,null,0,0,{"$f":"'Randlängen-Rund'!N53","v":0},0,0,{"$f":"Berechnungstabellen!K268","v":0},"","","",""]
[null,null,null,null,null,null,"Summe:","Durchschnitt",null,null,"."]
[null,null,null,null,null,null,{"$f":"SUM(G27:G33)","v":0},{"$f":"IF(H26=0,0,AVERAGEIF(H26:H33,\"<>0\"))","v":0},{"$f":"IF(I26=0,0,AVERAGEIF(I26:I33,\"<>0\"))","v":0}]
["Poularden",null,"max. Belegung je Stall:",null,4000,null,null,null,null,null,null,null,null,null,"max. kg / m²:",21,null,null,null,null,null,null,null,".",null,null,null,null,null,null,null,null,"mind. m²/Tier:",2.5,null,null,null,null,null,null,null,null,null,null,null,null,null,null,null,null,null,null,null,null,null,null,null,{"$f":"A36","v":"Poularden"}]
[null,null,null,null,null,null,{"$f":"D37-E37","v":0},{"$f":"IF(E37=0,0,G37/(C$2-C37))","v":0},{"$f":"IF(C37=0,0,IF(E37=0,0,1-(E37/D37)))","v":0},{"$f":"IF(B37=0,0,IF(B37<\"2021\",4,3))","v":0},null,{"$f":"IF(B37=0,0,IF(K37>J37,0,$E$36))","v":0},null,null,{"$f":"SUM(M37:N37)","v":0},{"$f":"IF(F37=0,0,IF(ROUNDDOWN(O37*P$36/F37,0)>$E$36,$E$36,(ROUNDDOWN(O37*P$36/F37,0))))","v":0},{"$f":"E37*$R$5","v":0},null,{"$f":"IF(ROUNDDOWN(R37/$R$5,0)>$E$5,$E$5,(ROUNDDOWN(R37/$R$5,0)))","v":0},{"$f":"$E37*$U$5","v":0},null,{"$f":"IF(ROUNDDOWN(U37/$U$5,0)>$E$25,$E$25,(ROUNDDOWN(U37/$U$5,0)))","v":0},{"$f":"S37+V37","v":0},{"$f":"E37/500*2","v":0},null,{"$f":"IF(E37=0,0,IF(Y37>X37,S37,(Y37/X37*E37)))","v":0},{"$f":"(E37/6)*$AB$5","v":0},null,{"$f":"IF(ROUNDDOWN(AB37*3*6,0)>$E$25,$E$25,(ROUNDDOWN(AB37*3*6,0)))","v":0},{"$f":"IF(P37=0,0,(O37/P37*E37/100*$AE$5))","v":0},null,{"$f":"IF(AE37>AD37,P37,IF(AD37=0,0,(AE37/AD37*E37)))","v":0},null,{"$f":"IF(ROUNDDOWN(AG37/$AH$25,0)>$E$25,$E$25,(ROUNDDOWN(AG37/$AH$25,0)))","v":0},null,{"$f":"A37","v":0},{"$f":"ROUNDDOWN(D37*10,0)","v":0},null,{"$f":"ROUNDDOWN(AL37/10,0)","v":0},{"$f":"ROUNDDOWN(D37*4,0)","v":0},{"$f":"'Randlängen-Rund'!S13","v":0},{"$f":"ROUNDDOWN(AO37/4,0)","v":0},{"$f":"IF((AM37+AP37)>$E$36,$E$36,AM37+AP37)","v":0},{"$f":"IF(D37=0,\"\",ROUNDDOWN(D37/10+1,0))","v":""},null,{"$f":"IF(ROUNDDOWN(AS37*10,0)>$E$36,$E$36,ROUNDDOWN(AS37*10,0))","v":0},{"$f":"ROUNDDOWN(D37*2.5,0)","v":0},null,{"$f":"ROUNDDOWN(AV37/2.5,0)","v":0},{"$f":"D37","v":0},{"$f":"'Randlängen-Rund'!N57","v":0},{"$f":"AY37/1","v":0},{"$f":"IF((AT37+AW37+AZ37)>$E$36,$E$36,AT37+AW37+AZ37)","v":0},{"$f":"Berechnungstabellen!K272","v":0},{"$f":"IF($BB37=0,\"\",IF($D37>$BB37,$D37-$BB37,0))","v":""},{"$f":"IF(D37>BB37,(D37-BB37)/BB37,\"\")","v":""},{"$f":"IF($BB37=0,\"\",IF($E37>$BB37,$E37-$BB37,0))","v":""},{"$f":"IF(E37>BB37,(E37-BB37)/BB37,\"\")","v":""}]
[null,null,null,null,null,null,0,0,{"$f":"IF(C38=0,0,IF(E38=0,0,1-(E38/D38)))","v":0},{"$f":"IF(B38=0,0,IF(B38<\"2021\",4,3))","v":0},null,{"$f":"IF(B38=0,0,IF(K38>J38,0,$E$36))","v":0},null,null,0,0,0,null,0,{"$f":"$E38*$U$5","v":0},null,0,{"$f":"S38+V38","v":0},0,null,{"$f":"IF(E38=0,0,IF(Y38>X38,S38,(Y38/X38*E38)))","v":0},0,null,0,0,null,0,null,{"$f":"IF(ROUNDDOWN(AG38/$AH$25,0)>$E$25,$E$25,(ROUNDDOWN(AG38/$AH$25,0)))","v":0},null,0,0,null,0,0,{"$f":"'Randlängen-Rund'!S14","v":0},0,0,"",null,0,{"$f":"ROUNDDOWN(D38*2.5,0)","v":0},null,0,0,{"$f":"'Randlängen-Rund'!N58","v":0},0,0,{"$f":"Berechnungstabellen!K273","v":0},"","",{"$f":"IF(BB38=0,\"\",IF(E38>BB38,E38-BB38,0))","v":""},""]
[null,null,null,null,null,null,0,0,0,0,null,0,null,null,0,0,0,null,0,0,null,0,0,0,null,0,0,null,0,0,null,0,null,0,null,0,0,null,0,0,{"$f":"'Randlängen-Rund'!S15","v":0},0,0,"",null,0,{"$f":"ROUNDDOWN(D39*2.5,0)","v":0},null,0,0,{"$f":"'Randlängen-Rund'!N59","v":0},0,0,{"$f":"Berechnungstabellen!K274","v":0},"","","",""]
[null,null,null,null,null,null,0,0,0,0,null,0,null,null,0,0,0,null,0,0,null,0,0,0,null,0,0,null,0,0,null,0,null,0,null,0,0,null,0,0,{"$f":"'Randlängen-Rund'!S16","v":0},0,0,"",null,0,0,null,0,0,{"$f":"'Randlängen-Rund'!N60","v":0},0,0,{"$f":"Berechnungstabellen!K275","v":0},"","","",""]
[null,null,null,null,null,null,0,0,0,0,null,0,null,null,0,0,0,null,0,0,null,0,0,0,null,0,0,null,0,0,null,0,null,0,null,0,0,null,0,0,{"$f":"'Randlängen-Rund'!S17","v":0},0,0,"",null,0,0,null,0,0,{"$f":"'Randlängen-Rund'!N61","v":0},0,0,{"$f":"Berechnungstabellen!K276","v":0},"","","",""]
[null,null,null,null,null,null,0,0,0,0,null,0,null,null,0,0,0,null,0,0,null,0,0,0,null,0,0,null,0,0,null,0,null,0,null,0,0,null,0,0,{"$f":"'Randlängen-Rund'!S18","v":0},0,0,"",null,0,0,null,0,0,{"$f":"'Randlängen-Rund'!N62","v":0},0,0,{"$f":"Berechnungstabellen!K277","v":0},"","","",""]
[null,null,null,null,null,null,0,0,0,0,null,0,null,null,0,0,0,null,0,{"$f":"$E43*$U$5","v":0},null,0,0,0,null,0,0,null,0,0,null,0,null,0,null,0,0,null,0,0,{"$f":"'Randlängen-Rund'!S19","v":0},0,0,"",null,0,0,null,0,0,{"$f":"'Randlängen-Rund'!N63","v":0},0,0,{"$f":"Berechnungstabellen!K278","v":0},"","","",""]
[null,null,null,null,null,null,0,0,0,0,null,0,null,null,0,0,0,null,0,0,null,0,0,0,null,0,0,null,0,0,null,0,null,0,null,0,0,null,0,0,{"$f":"'Randlängen-Rund'!S20","v":0},0,0,"",null,0,0,null,0,0,{"$f":"'Randlängen-Rund'!N64","v":0},0,0,{"$f":"Berechnungstabellen!K279","v":0},"","","",""]
[null,null,null,null,null,null,"Summe:","Durchschnitt"]
[null,null,null,null,null,null,{"$f":"SUM(G38:G44)","v":0},{"$f":"IF(H37=0,0,AVERAGEIF(H37:H44,\"<>0\"))","v":0},{"$f":"IF(I37=0,0,AVERAGEIF(I37:I44,\"<>0\"))","v":0},null,null,null,"Geprüfte Maßangaben:"]
[]
["Anmerkungen / Kommentare"]

{"sheet":"Mastputen","index":10,"n_rows":28,"n_cols":58,"rows_kept":28,"cut":false,"hidden":false,"merged":[[27,4,27,33],[25,3,25,33],[1,29,1,31],[4,32,4,33],[13,32,13,33],[13,29,13,31],[13,26,13,28],[23,7,23,8]]}
["Ermittlung der maximalen Tierzahl, die gem. EU VO 2018/848 sowie 2020/464 Anhang I je Stall gehalten werden darf",null,null,null,null,null,null,null,null,null,null,null,null,null,null,null,null,null,null,null,null,null,null,null,null,null,null,null,null,null,null,null,null,null,null,null,null,null,null,null,null,null,null,null,null,null,null,null,null,null,null,null,null,null,null,null,null,"Mastputen"]
[null,null,{"$f":"TODAY()","v":"2025-05-23"},"Belegung",null,null,null,"Tierverluste",null,null,null,null,null,"Stall",null,null,null,"Sitzstangen ",null,null,"Sitzebenen",null,null,null,"Luken \n(Stall-AKB)",null,null,"Scharraumfläche",null,"Auslauföffnungen\n(AKB – Auslauf)",null,null,"Auslauf \n(bis 150 /350 m)",null,null,"Zusatzangaben: gem. TierSchNutztV (verpflichtend!)",null,null,null,null,null,null,null,"Info zur Sollermittlung: Bezugswert = Anzahl Tiere bei Einstallung",null,null,null,null,null,null,null,null,null,null,null,"Auswertung"]
[null,null,null,null,null,null,null,null,null,"Voliere Ebenen",null,null,"Warm-\nstall","Isolierte  Veranda","Ergebnis Stall",null,null,null,null,null,null,null,null,null,null,null,null,null,null,null,null,null,null,null,null,null,null,null,"Futter",null,null,null,null,null,null,null,null,"Tränken",null,null,null,null,null,null,"Überschreitung bei Einstallung",null,"Überschreitung aktuell"]
["Name\nStall (lt. Stall-plan)","Baujahr","Einstall-\ndatum","Tierzahl\nbei Ein-stallung","Belegung\nakt.","Durch-schnitts-gewicht aktuell","Gesamt (Anzahl Tiere)","Tiere je Tag","%","Ebenen max","Ebenen ist","Tiere Max.","m²","m²\njederzeit nutzbar\n","Summe \nm²","Kapa-\nzität\nTiere gem. Gewicht","soll m","ist\nm","Kapa-\nzität\n(Tierzahl)","soll cm2","ist\ncm2","Kapa-\nzität\n(Tierzahl)","Kapa-\nzität Sitze gesamt\n(Tierzahl)","soll m","ist\nm","Kapa-\nzität\n(Tierzahl)","soll\nm²","ist\nm²","Kapa-\nzität\n(Tierzahl)","soll\nm","ist\nm","Kapa-\nzität\n(Tierzahl)","ist\nm²","Kapa-\nzität\n(Tierzahl)",null,"Stall","Futtertröge Rinnen",null,null," Futtertröge Rund",null,null,"Futter-tröge ges.","Tränkeanzahl (Nippel)",null,null,"Rinnentränke",null,null,"Rundtränke",null,null,"Tränken ges.","Kapa-\nzität \nMin. aller Krite-\nrien \n","Anzahl Tiere","Einstal-lung\n%","Anzahl Tiere","aktuell %"]
["Feste Ställe",null,"max. Belegung je Stall:",null,2500,".",".",null,null,null,null,null,null,null,"max. kg / m²:",21,"mind. ",0.1,"m / Tier","mind. ",100,"cm2 / Tier",null,"mind. 2m/500 Tiere",null,null,"mind. ",0.33329999999999999," der notw. Fläche","mind. ",4,"m/100m²","mind. 4m²/Tier",null,null,null,"soll (cm)","ist (cm)","Kapa-\nzität\n(Tierzahl)","soll (cm)","ist (cm)","Kapa-\nzität\n(Tierzahl)","Kapa-\nzität\n(Tierzahl)","soll","ist (Anzahl)","Kapa-\nzität\n(Tierzahl)","soll (cm)","ist (cm)","Kapa-\nzität\n(Tierzahl)","soll (cm)","ist (cm)","Kapa-\nzität\n(Tierzahl)","Summe Tränken"]
[null,null,null,null,null,null,{"$f":"D6-E6","v":0},{"$f":"IF(E6=0,0,G6/(C$2-C6))","v":0},{"$f":"IF(C6=0,0,IF(E6=0,0,1-(E6/D6)))","v":0},{"$f":"IF(B6=0,0,IF(B6<\"2021\",4,3))","v":0},null,{"$f":"IF(B6=0,0,IF(K6>J6,0,$E$5))","v":0},null,null,{"$f":"SUM(M6:N6)","v":0},{"$f":"IF(F6=0,0,IF(ROUNDDOWN(O6*P$5/F6,0)>$E$5,$E$5,(ROUNDDOWN(O6*P$5/F6,0))))","v":0},{"$f":"E6*$R$5","v":0},null,{"$f":"IF(ROUNDDOWN(R6/$R$5,0)>$E$5,$E$5,(ROUNDDOWN(R6/$R$5,0)))","v":0},{"$f":"$E6*$U$5","v":0},null,{"$f":"IF(ROUNDDOWN(U6/$U$5,0)>$E$5,$E$5,(ROUNDDOWN(U6/$U$5,0)))","v":0},{"$f":"S6+V6","v":0},{"$f":"D6/500*2","v":0},null,{"$f":"IF(E6=0,0,IF(Y6>X6,P6,(Y6/X6*E6)))","v":0},{"$f":"(E6/6)*$AB$5","v":0},{"$f":"N6","v":0},{"$f":"IF(ROUNDDOWN(AB6*3*6,0)>$E$5,$E$5,(ROUNDDOWN(AB6*3*6,0)))","v":0},{"$f":"IF(P6=0,0,(E6*F6/$P$5/100*$AE$5))","v":0},null,{"$f":"IF(AE6>AD6,P6,IF(AD6=0,0,(AE6/AD6*E6)))","v":0},null,{"$f":"IF(ROUNDDOWN(AG6/4,0)>$E$5,$E$5,(ROUNDDOWN(AG6/4,0)))","v":0},null,{"$f":"A6","v":0},{"$f":"ROUNDDOWN(D6*10,0)","v":0},null,{"$f":"ROUNDDOWN(AL6/10,0)","v":0},{"$f":"ROUNDDOWN(D6*4,0)","v":0},{"$f":"'Randlängen-Rund'!X4","v":0},{"$f":"ROUNDDOWN(AO6/4,0)","v":0},{"$f":"IF(AM6+AP6>$E$5,$E$5,AM6+AP6)","v":0},{"$f":"IF(D6=0,\"\",ROUNDDOWN(D6/10+1,0))","v":""},null,{"$f":"IF(ROUNDDOWN(AS6*10,0)>$E$5,$E$5,ROUNDDOWN(AS6*10,0))","v":0},{"$f":"ROUNDDOWN(C6*2.5,0)","v":0},null,{"$f":"ROUNDDOWN(AV6/2.5,0)","v":0},{"$f":"D6","v":0},{"$f":"'Randlängen-Rund'!X26","v":0},{"$f":"AY6/1","v":0},{"$f":"IF(AT6+AW6+AZ6>$E$5,$E$5,AT6+AW6+AZ6)","v":0},{"$f":"Berechnungstabellen!K284","v":0},{"$f":"IF($BB6=0,\"\",IF($D6>$BB6,$D6-$BB6,0))","v":""},{"$f":"IF(D6>BB6,(D6-BB6)/BB6,\"\")","v":""},{"$f":"IF($BB6=0,\"\",IF($E6>$BB6,$E6-$BB6,0))","v":""},{"$f":"IF(E6>BB6,(E6-BB6)/BB6,\"\")","v":""}]
[null,null,null,null,null,null,{"$f":"D7-E7","v":0},{"$f":"IF(E7=0,0,G7/(C$2-C7))","v":0},{"$f":"IF(C7=0,0,IF(E7=0,0,1-(E7/D7)))","v":0},{"$f":"IF(B7=0,0,IF(B7<\"2021\",4,3))","v":0},null,{"$f":"IF(B7=0,0,IF(K7>J7,0,$E$5))","v":0},null,null,0,{"$f":"IF(F7=0,0,IF(ROUNDDOWN(O7*P$5/F7,0)>$E$5,$E$5,(ROUNDDOWN(O7*P$5/F7,0))))","v":0},0,null,0,{"$f":"$E7*$U$5","v":0},null,0,{"$f":"S7+V7","v":0},0,null,{"$f":"IF(E7=0,0,IF(Y7>X7,P7,(Y7/X7*E7)))","v":0},0,0,0,0,null,0,null,0,null,0,0,null,0,0,{"$f":"'Randlängen-Rund'!X5","v":0},0,0,"",null,{"$f":"IF(ROUNDDOWN(AS7*10,0)>$E$5,$E$5,ROUNDDOWN(AS7*10,0))","v":0},{"$f":"ROUNDDOWN(C7*2.5,0)","v":0},null,0,0,{"$f":"'Randlängen-Rund'!X27","v":0},{"$f":"AY7/1","v":0},0,{"$f":"Berechnungstabellen!K285","v":0},"","",{"$f":"IF(BB7=0,\"\",IF(E7>BB7,E7-BB7,0))","v":""},""]
[null,null,null,null,null,null,0,0,0,0,null,0,null,null,0,0,0,null,0,0,null,0,0,0,null,0,0,0,0,0,null,0,null,0,null,0,0,null,0,0,{"$f":"'Randlängen-Rund'!X6","v":0},0,0,"",null,0,{"$f":"ROUNDDOWN(C8*2.5,0)","v":0},null,0,0,{"$f":"'Randlängen-Rund'!X28","v":0},0,0,{"$f":"Berechnungstabellen!K286","v":0},"","","",""]
[null,null,null,null,null,null,0,0,0,0,null,0,null,null,0,0,0,null,0,0,null,0,0,0,null,0,0,0,0,0,null,0,null,0,null,0,0,null,0,0,{"$f":"'Randlängen-Rund'!X7","v":0},0,0,"",null,0,0,null,0,0,{"$f":"'Randlängen-Rund'!X29","v":0},0,0,{"$f":"Berechnungstabellen!K287","v":0},"","","",""]
[null,null,null,null,null,null,0,0,0,0,null,0,null,null,0,0,0,null,0,0,null,0,0,0,null,0,0,0,0,0,null,{"$f":"IF(AE10>AD10,P10,IF(AD10=0,0,(AE10/AD10*E10)))","v":0},null,0,null,0,0,null,0,0,{"$f":"'Randlängen-Rund'!X8","v":0},0,0,"",null,0,0,null,0,0,{"$f":"'Randlängen-Rund'!X30","v":0},0,0,{"$f":"Berechnungstabellen!K288","v":0},"","","",""]
[null,null,null,null,null,null,0,0,0,0,null,0,null,null,0,0,0,null,0,0,null,0,0,0,null,0,0,0,0,0,null,{"$f":"IF(AE11>AD11,P11,IF(AD11=0,0,(AE11/AD11*E11)))","v":0},null,0,null,0,0,null,0,0,{"$f":"'Randlängen-Rund'!X9","v":0},0,0,"",null,0,0,null,0,0,{"$f":"'Randlängen-Rund'!X31","v":0},0,0,{"$f":"Berechnungstabellen!K289","v":0},"","","",""]
[null,null,null,null,null,null,0,0,0,0,null,0,null,null,0,0,0,null,0,0,null,0,0,0,null,0,0,0,0,0,null,0,null,0,null,0,0,null,0,0,{"$f":"'Randlängen-Rund'!X10","v":0},0,0,"",null,0,0,null,0,0,{"$f":"'Randlängen-Rund'!X32","v":0},0,0,{"$f":"Berechnungstabellen!K290","v":0},"","","",""]
[null,null,null,null,null,null,0,0,0,0,null,0,null,null,0,0,0,null,0,0,null,0,0,0,null,0,0,0,0,0,null,0,null,0,null,0,0,null,0,0,{"$f":"'Randlängen-Rund'!X11","v":0},0,0,"",null,0,0,null,0,0,{"$f":"'Randlängen-Rund'!X33","v":0},0,0,{"$f":"Berechnungstabellen!K291","v":0},"","","",""]
["Bewegl. Ställe",null,"max. Belegung je Stall:",null,2500,".",null,null,null,null,null,null,null,null,"max. kg / m²:",21,null,null,null,null,null,null,null,"."]
[null,null,null,null,null,null,{"$f":"D15-E15","v":0},{"$f":"IF(E15=0,0,G15/(C$2-C15))","v":0},{"$f":"IF(C15=0,0,IF(E15=0,0,1-(E15/D15)))","v":0},{"$f":"IF(B15=0,0,IF(B15<\"2021\",4,3))","v":0},null,{"$f":"IF(B15=0,0,IF(K15>J15,0,$E$14))","v":0},null,null,{"$f":"SUM(M15:N15)","v":0},{"$f":"IF(F15=0,0,IF(ROUNDDOWN(O15*P$14/F15,0)>$E$14,$E$14,(ROUNDDOWN(O15*P$14/F15,0))))","v":0},{"$f":"E15*$R$5","v":0},null,{"$f":"IF(ROUNDDOWN(R15/$R$5,0)>$E$5,$E$5,(ROUNDDOWN(R15/$R$5,0)))","v":0},{"$f":"$E15*$U$5","v":0},null,{"$f":"IF(ROUNDDOWN(U15/$U$5,0)>$E$14,$E$14,(ROUNDDOWN(U15/$U$5,0)))","v":0},{"$f":"S15+V15","v":0},{"$f":"D15/500*2","v":0},null,{"$f":"IF(E15=0,0,IF(Y15>X15,S15,(Y15/X15*E15)))","v":0},{"$f":"(E15/6)*$AB$5","v":0},{"$f":"N15","v":0},{"$f":"IF(ROUNDDOWN(AB15*3*6,0)>$E$14,$E$14,(ROUNDDOWN(AB15*3*6,0)))","v":0},{"$f":"IF(P15=0,0,(E15*F15/$P$5/100*$AE$5))","v":0},null,{"$f":"IF(AE15>AD15,P15,IF(AD15=0,0,(AE15/AD15*E15)))","v":0},null,{"$f":"IF(ROUNDDOWN(AG15/4,0)>$E$14,$E$14,(ROUNDDOWN(AG15/4,0)))","v":0},null,{"$f":"A15","v":0},{"$f":"ROUNDDOWN(D15*10,0)","v":0},null,{"$f":"ROUNDDOWN(AL15/10,0)","v":0},{"$f":"ROUNDDOWN(D15*4,0)","v":0},{"$f":"'Randlängen-Rund'!X13","v":0},{"$f":"ROUNDDOWN(AO15/4,0)","v":0},{"$f":"IF(AM15+AP15>$E$14,$E$14,AM15+AP15)","v":0},{"$f":"IF(D15=0,\"\",ROUNDDOWN(D15/10+1,0))","v":""},null,{"$f":"IF(ROUNDDOWN(AS15*10,0)>$E$5,$E$5,ROUNDDOWN(AS15*10,0))","v":0},{"$f":"ROUNDDOWN(C15*2.5,0)","v":0},null,{"$f":"ROUNDDOWN(AV15/2.5,0)","v":0},{"$f":"D15","v":0},{"$f":"'Randlängen-Rund'!X35","v":0},{"$f":"AY15/1","v":0},{"$f":"IF(AT15+AW15+AZ15>$E$14,$E$14,AT15+AW15+AZ15)","v":0},{"$f":"Berechnungstabellen!K293","v":0},{"$f":"IF($BB15=0,\"\",IF($D15>$BB15,$D15-$BB15,0))","v":""},{"$f":"IF(D15>BB15,(D15-BB15)/BB15,\"\")","v":""},{"$f":"IF($BB15=0,\"\",IF($E15>$BB15,$E15-$BB15,0))","v":""},{"$f":"IF(E15>BB15,(E15-BB15)/BB15,\"\")","v":""}]
[null,null,null,null,null,null,0,0,{"$f":"IF(C16=0,0,IF(E16=0,0,1-(E16/D16)))","v":0},{"$f":"IF(B16=0,0,IF(B16<\"2021\",4,3))","v":0},null,{"$f":"IF(B16=0,0,IF(K16>J16,0,$E$14))","v":0},null,null,0,{"$f":"IF(F16=0,0,IF(ROUNDDOWN(O16*P$14/F16,0)>$E$14,$E$14,(ROUNDDOWN(O16*P$14/F16,0))))","v":0},0,null,0,{"$f":"$E16*$U$5","v":0},null,0,{"$f":"S16+V16","v":0},0,null,{"$f":"IF(E16=0,0,IF(Y16>X16,S16,(Y16/X16*E16)))","v":0},0,0,0,0,null,0,null,0,null,0,0,null,0,0,{"$f":"'Randlängen-Rund'!X14","v":0},0,{"$f":"IF(AM16+AP16>$E$14,$E$14,AM16+AP16)","v":0},"",null,{"$f":"IF(ROUNDDOWN(AS16*10,0)>$E$5,$E$5,ROUNDDOWN(AS16*10,0))","v":0},{"$f":"ROUNDDOWN(C16*2.5,0)","v":0},null,0,0,{"$f":"'Randlängen-Rund'!X36","v":0},0,{"$f":"IF(AT16+AW16+AZ16>$E$14,$E$14,AT16+AW16+AZ16)","v":0},{"$f":"Berechnungstabellen!K294","v":0},"","",{"$f":"IF(BB16=0,\"\",IF(E16>BB16,E16-BB16,0))","v":""},""]
[null,null,null,null,null,null,0,0,0,0,null,0,null,null,0,0,0,null,0,0,null,0,0,0,null,0,0,0,0,0,null,0,null,0,null,0,0,null,0,0,{"$f":"'Randlängen-Rund'!X15","v":0},0,0,"",null,0,{"$f":"ROUNDDOWN(C17*2.5,0)","v":0},null,0,0,{"$f":"'Randlängen-Rund'!X37","v":0},0,0,{"$f":"Berechnungstabellen!K295","v":0},"","","",""]
[null,null,null,null,null,null,0,0,0,0,null,0,null,null,0,0,0,null,0,0,null,0,0,0,null,0,0,0,0,0,null,0,null,0,null,0,0,null,0,0,{"$f":"'Randlängen-Rund'!X16","v":0},0,0,"",null,0,0,null,0,0,{"$f":"'Randlängen-Rund'!X38","v":0},0,0,{"$f":"Berechnungstabellen!K296","v":0},"","","",""]
[null,null,null,null,null,null,0,0,0,0,null,0,null,null,0,0,0,null,0,0,null,0,0,0,null,0,0,0,0,0,null,0,null,0,null,0,0,null,0,0,{"$f":"'Randlängen-Rund'!X17","v":0},0,0,"",null,0,0,null,0,0,{"$f":"'Randlängen-Rund'!X39","v":0},0,0,{"$f":"Berechnungstabellen!K297","v":0},"","","",""]
[null,null,null,null,null,null,0,0,0,0,null,0,null,null,0,0,0,null,0,0,null,0,0,0,null,0,0,0,0,0,null,0,null,0,null,0,0,null,0,0,{"$f":"'Randlängen-Rund'!X18","v":0},0,0,"",null,0,0,null,0,0,{"$f":"'Randlängen-Rund'!X40","v":0},0,0,{"$f":"Berechnungstabellen!K298","v":0},"","","",""]
[null,null,null,null,null,null,0,0,0,0,null,0,null,null,0,0,0,null,0,0,null,0,0,0,null,0,0,0,0,0,null,0,null,0,null,0,0,null,0,0,{"$f":"'Randlängen-Rund'!X19","v":0},0,0,"",null,0,0,null,0,0,{"$f":"'Randlängen-Rund'!X41","v":0},0,0,{"$f":"Berechnungstabellen!K299","v":0},"","","",""]
[null,null,null,null,null,null,0,0,0,0,null,0,null,null,0,0,0,null,0,{"$f":"$E22*$U$5","v":0},null,0,0,0,null,0,0,0,0,0,null,0,null,0,null,0,0,null,0,0,{"$f":"'Randlängen-Rund'!X20","v":0},0,0,"",null,0,0,null,0,0,{"$f":"'Randlängen-Rund'!X42","v":0},0,0,{"$f":"Berechnungstabellen!K300","v":0},"","","",""]
[null,null,null,null,null,null,0,0,0,{"$f":"IF(B23=0,0,IF(B23<\"2021\",4,3))","v":0},null,0,null,null,0,0,0,null,0,0,null,0,0,0,null,0,0,0,0,0,null,0,null,0,null,0,0,null,0,0,{"$f":"'Randlängen-Rund'!X21","v":0},0,0,"",null,0,{"$f":"ROUNDDOWN(C23*2.5,0)","v":0},null,0,0,{"$f":"'Randlängen-Rund'!X43","v":0},0,0,{"$f":"Berechnungstabellen!K301","v":0},"",{"$f":"IF(D23>BB23,(D23-BB23)/BB23,\"\")","v":""},{"$f":"IF(BB23=0,\"\",IF(E23>BB23,E23-BB23,0))","v":""},{"$f":"IF(E23>BB23,(E23-BB23)/BB23,\"\")","v":""}]
[null,null,null,"Summen:",null,null,"Summe:","Durchschnitt"]
[null,null,null,{"$f":"SUM(D6:D23)","v":0},{"$f":"SUM(E6:E23)-E14","v":0},null,{"$f":"SUM(G6:G23)","v":0},{"$f":"IF(H6=0,0,AVERAGEIF(H6:H23,\"<>0\"))","v":0},{"$f":"IF(I6=0,0,AVERAGEIF(I6:I23,\"<>0\"))","v":0}]
["Geprüfte Maßangaben:"]
[]
["Anmerkungen / Kommentare"]

{"sheet":"Mastgeflügel","index":11,"n_rows":29,"n_cols":58,"rows_kept":29,"cut":false,"hidden":false,"merged":[[1,29,1,31],[1,32,1,33],[19,32,19,33],[26,3,26,33],[28,4,28,33],[4,32,4,33],[5,16,8,18],[9,32,9,33],[10,16,13,18],[14,32,14,33],[15,16,18,18],[5,19,8,22],[10,19,13,22],[15,19,18,22]]}
["Ermittlung der maximalen Tierzahl, die gem EU VO 889/2008 Anhang III  je Stall gehalten werden darf",null,null,null,null,null,null,null,null,null,null,null,null,null,null,null,null,null,null,null,null,null,null,null,null,null,null,null,null,null,null,null,null,null,null,null,null,null,null,null,null,null,null,null,null,null,null,null,null,null,null,null,null,null,null,null,null,"Mastgeflügel sonst."]
[null,null,{"$f":"TODAY()","v":"2025-05-23"},"Belegung",null,null,null,"Tierverluste",null,null,null,null,null,"Stall",null,null,null,"Sitzstangen ",null,null,"Sitzebenen",null,null,null,"Luken \n(Stall-AKB)",null,null,"Scharraumfläche",null,"Auslauföffnungen\n(AKB – Auslauf)",null,null,"Auslauf \n(bis 150 /350 m)",null,null,"Zusatzangaben: gem. TierSchNutztV (verpflichtend!)",null,null,null,null,null,null,null,"Info zur Sollermittlung: Bezugswert = Anzahl Tiere bei Einstallung",null,null,null,null,null,null,null,null,null,null,null,"Auswertung"]
[null,null,null,null,null,null,null,null,null,"Voliere Ebenen",null,null,"Warm-\nstall","Isolierte  Veranda","Ergebnis Stall",null,null,null,null,null,null,null,null,null,null,null,null,null,null,null,null,null,null,null,null,null,"Futter",null,null,null,null,null,null,"Tränken",null,null,null,null,null,null,null,null,null,null,"Überschreitung bei Einstallung",null,"Überschreitung aktuell"]
["Name\nStall (lt. Stall-plan)","Baujahr","Einstall-\ndatum","Tierzahl\nbei Ein-stallung","Belegung\nakt.","Durch-schnitts-gewicht aktuell","Gesamt (Anzahl Tiere)","Tiere je Tag","%","Ebenen max","Ebenen ist","Tiere Max.","m²","m²\njederzeit nutzbar\n","Summe \nm²","Kapa-\nzität\nTiere gem. Gewicht","soll m","ist\nm","Kapa-\nzität\n(Tierzahl)","soll cm2","ist\ncm2","Kapa-\nzität\n(Tierzahl)","Kapa-\nzität Sitze gesamt\n(Tierzahl)","soll\nm","ist\nm","Kapa-\nzität\n(Tierzahl)","soll\nm²","ist\nm²","Kapa-\nzität\n(Tierzahl)","soll\nm","ist\nm","Kapa-\nzität\n(Tierzahl)","ist\nm²","Kapa-\nzität\n(Tierzahl)",null,"Stall","Futtertröge Rinnen",null,null," Futtertröge Rund",null,null,"Futtertröge ges.","Tränkeanzahl (Nippel)",null,null,"Rinnentränke",null,null,"Rundtränke",null,null,"Tränken ges.","Kapa-\nzität \nMin. aller Krite-\nrien \n","Anzahl Tiere","Einstal-lung\n%","Anzahl Tiere","aktuell %"]
["Gänse",null,"max. Belegung je Stall:",null,2500,".",".",null,null,null,null,null,null,null,"max. kg / m²:",21,null,null,null,null,null,null,null,"mind. 2m/500 Tiere",null,null,"mind. ",0.33329999999999999," der notw. Fläche","mind. ",4,"m/100m²","mind. 4m²/Tier",null,null,{"$f":"A5","v":"Gänse"},"soll (cm)","ist (cm)","Kapa-\nzität\n(Tierzahl)","soll (cm)","ist (cm)","Kapa-\nzität\n(Tierzahl)","Kapa-\nzität\n(Tierzahl)","soll","ist (Anzahl)","Kapa-\nzität\n(Tierzahl)","soll (cm)","ist (cm)","Kapa-\nzität\n(Tierzahl)","soll (cm)","ist (cm)","Kapa-\nzität\n(Tierzahl)","Summe Tränken"]
[null,null,null,null,null,null,{"$f":"D6-E6","v":0},{"$f":"IF(E6=0,0,G6/(C$2-C6))","v":0},{"$f":"IF(C6=0,0,IF(E6=0,0,1-(E6/D6)))","v":0},{"$f":"IF(B6=0,0,IF(B6<\"2021\",4,3))","v":0},null,{"$f":"IF(B6=0,0,IF(K6>J6,0,$E$5))","v":0},null,null,{"$f":"SUM(M6:N6)","v":0},{"$f":"IF(F6=0,0,IF(ROUNDDOWN(O6*P$5/F6,0)>$E$5,$E$5,(ROUNDDOWN(O6*P$5/F6,0))))","v":0},"Nicht relevant",null,null,"Nicht relevant",null,null,null,{"$f":"D6/500*2","v":0},null,{"$f":"IF(E6=0,0,IF(Y6>X6,P6,(Y6/X6*E6)))","v":0},{"$f":"(E6/6)*$AB$5","v":0},null,{"$f":"IF(ROUNDDOWN(AB6*3*6,0)>$E$5,$E$5,(ROUNDDOWN(AB6*3*6,0)))","v":0},{"$f":"IF(P6=0,0,(E6*F6/$P$5/100*$AE$5))","v":0},10.97,{"$f":"IF(AE6>AD6,P6,IF(AD6=0,0,(AE6/AD6*E6)))","v":0},null,{"$f":"IF(ROUNDDOWN(AG6/4,0)>$E$5,$E$5,(ROUNDDOWN(AG6/4,0)))","v":0},null,0,{"$f":"ROUNDDOWN(D6*10,0)","v":0},null,{"$f":"ROUNDDOWN(AL6/10,0)","v":0},{"$f":"ROUNDDOWN(D6*4,0)","v":0},{"$f":"'Randlängen-Rund'!AC5","v":0},{"$f":"ROUNDDOWN(AO6/4,0)","v":0},{"$f":"IF(AM6+AP6>$E$5,$E$5,AM6+AP6)","v":0},{"$f":"IF(D6=0,\"\",ROUNDDOWN(D6/10+1,0))","v":""},null,{"$f":"IF(ROUNDDOWN(AS6*10,0)>$E$5,$E$5,ROUNDDOWN(AS6*10,0))","v":0},{"$f":"ROUNDDOWN(D6*2.5,0)","v":0},null,{"$f":"ROUNDDOWN(AV6/2.5,0)","v":0},{"$f":"D6","v":0},{"$f":"'Randlängen-Rund'!AC27","v":0},{"$f":"AY6/1","v":0},{"$f":"IF(AT6+AW6+AZ6>$E$5,$E$5,AT6+AW6+AZ6)","v":0},{"$f":"Berechnungstabellen!K307","v":0},{"$f":"IF(BB6=0,\"\",D6-BB6)","v":""},{"$f":"IF(D6>BB6,(D6-BB6)/BB6,\"\")","v":""},{"$f":"IF(BB6=0,\"\",IF(E6>BB6,E6-BB6,0))","v":""},{"$f":"IF($E6>$BB6,($E6-$BB6)/$BB6,\"\")","v":""}]
[null,null,null,null,null,null,{"$f":"D7-E7","v":0},{"$f":"IF(E7=0,0,G7/(C$2-C7))","v":0},{"$f":"IF(C7=0,0,IF(E7=0,0,1-(E7/D7)))","v":0},{"$f":"IF(B7=0,0,IF(B7<\"2021\",4,3))","v":0},null,{"$f":"IF(B7=0,0,IF(K7>J7,0,$E$5))","v":0},null,null,{"$f":"SUM(M7:N7)","v":0},{"$f":"IF(F7=0,0,IF(ROUNDDOWN(O7*P$5/F7,0)>$E$5,$E$5,(ROUNDDOWN(O7*P$5/F7,0))))","v":0},null,null,null,null,null,null,null,{"$f":"D7/500*2","v":0},null,{"$f":"IF(E7=0,0,IF(Y7>X7,P7,(Y7/X7*E7)))","v":0},{"$f":"(E7/6)*$AB$5","v":0},null,0,{"$f":"IF(P7=0,0,(E7*F7/$P$5/100*$AE$5))","v":0},null,0,null,0,null,0,{"$f":"ROUNDDOWN(D7*10,0)","v":0},null,0,{"$f":"ROUNDDOWN(D7*4,0)","v":0},{"$f":"'Randlängen-Rund'!AC6","v":0},0,{"$f":"IF(AM7+AP7>$E$5,$E$5,AM7+AP7)","v":0},{"$f":"IF(D7=0,\"\",ROUNDDOWN(D7/10+1,0))","v":""},null,{"$f":"IF(ROUNDDOWN(AS7*10,0)>$E$5,$E$5,ROUNDDOWN(AS7*10,0))","v":0},{"$f":"ROUNDDOWN(D7*2.5,0)","v":0},null,0,{"$f":"D7","v":0},{"$f":"'Randlängen-Rund'!AC28","v":0},0,{"$f":"IF(AT7+AW7+AZ7>$E$5,$E$5,AT7+AW7+AZ7)","v":0},{"$f":"Berechnungstabellen!K308","v":0},{"$f":"IF(BB7=0,\"\",D7-BB7)","v":""},{"$f":"IF(D7>BB7,(D7-BB7)/BB7,\"\")","v":""},{"$f":"IF(BB7=0,\"\",IF(E7>BB7,E7-BB7,0))","v":""},{"$f":"IF($E7>$BB7,($E7-$BB7)/$BB7,\"\")","v":""}]
[null,null,null,null,null,null,0,0,0,0,null,0,null,null,{"$f":"SUM(M8:N8)","v":0},0,null,null,null,null,null,null,null,{"$f":"D8/500*2","v":0},null,0,{"$f":"(E8/6)*$AB$5","v":0},null,0,{"$f":"IF(P8=0,0,(E8*F8/$P$5/100*$AE$5))","v":0},null,0,null,0,null,0,{"$f":"ROUNDDOWN(D8*10,0)","v":0},null,0,{"$f":"ROUNDDOWN(D8*4,0)","v":0},{"$f":"'Randlängen-Rund'!AC7","v":0},0,{"$f":"IF(AM8+AP8>$E$5,$E$5,AM8+AP8)","v":0},{"$f":"IF(D8=0,\"\",ROUNDDOWN(D8/10+1,0))","v":""},null,{"$f":"IF(ROUNDDOWN(AS8*10,0)>$E$5,$E$5,ROUNDDOWN(AS8*10,0))","v":0},0,null,0,{"$f":"D8","v":0},{"$f":"'Randlängen-Rund'!AC29","v":0},0,{"$f":"IF(AT8+AW8+AZ8>$E$5,$E$5,AT8+AW8+AZ8)","v":0},{"$f":"Berechnungstabellen!K309","v":0},{"$f":"IF(BB8=0,\"\",D8-BB8)","v":""},{"$f":"IF(D8>BB8,(D8-BB8)/BB8,\"\")","v":""},"",{"$f":"IF($E8>$BB8,($E8-$BB8)/$BB8,\"\")","v":""}]
[null,null,null,null,null,null,0,0,0,0,null,0,null,null,{"$f":"SUM(M9:N9)","v":0},0,null,null,null,null,null,null,null,{"$f":"D9/500*2","v":0},null,0,{"$f":"(E9/6)*$AB$5","v":0},null,0,{"$f":"IF(P9=0,0,(E9*F9/$P$5/100*$AE$5))","v":0},null,0,null,0,null,0,{"$f":"ROUNDDOWN(D9*10,0)","v":0},null,0,{"$f":"ROUNDDOWN(D9*4,0)","v":0},{"$f":"'Randlängen-Rund'!AC8","v":0},0,{"$f":"IF(AM9+AP9>$E$5,$E$5,AM9+AP9)","v":0},{"$f":"IF(D9=0,\"\",ROUNDDOWN(D9/10+1,0))","v":""},null,{"$f":"IF(ROUNDDOWN(AS9*10,0)>$E$5,$E$5,ROUNDDOWN(AS9*10,0))","v":0},0,null,0,{"$f":"D9","v":0},{"$f":"'Randlängen-Rund'!AC30","v":0},0,{"$f":"IF(AT9+AW9+AZ9>$E$5,$E$5,AT9+AW9+AZ9)","v":0},{"$f":"Berechnungstabellen!K310","v":0},{"$f":"IF(BB9=0,\"\",D9-BB9)","v":""},{"$f":"IF(D9>BB9,(D9-BB9)/BB9,\"\")","v":""},"",{"$f":"IF($E9>$BB9,($E9-$BB9)/$BB9,\"\")","v":""}]
["Enten wbl.",null,"max. Belegung je Stall:",null,4000,".",".",null,null,null,null,null,null,null,"max. kg / m²:",21,null,null,null,null,null,null,null,"mind. 2m/500 Tiere",null,null,"mind. ",0.33329999999999999," der notw. Fläche","mind. ",4,"m/100m²","mind. 4m²/Tier",null,null,"Enten wbl."]
[null,null,null,null,null,null,{"$f":"D11-E11","v":0},{"$f":"IF(E11=0,0,G11/(C$2-C11))","v":0},{"$f":"IF(C11=0,0,IF(E11=0,0,1-(E11/D11)))","v":0},{"$f":"IF(B11=0,0,IF(B11<\"2021\",4,3))","v":0},null,{"$f":"IF(B11=0,0,IF(K11>J11,0,$E$10))","v":0},null,null,{"$f":"SUM(M11:N11)","v":0},{"$f":"IF(F11=0,0,IF(ROUNDDOWN(O11*P$10/F11,0)>$E$5,$E$5,(ROUNDDOWN(O11*P$10/F11,0))))","v":0},"Nicht relevant",null,null,"Nicht relevant",null,null,null,{"$f":"D11/500*2","v":0},null,{"$f":"IF(E11=0,0,IF(Y11>X11,P11,(Y11/X11*E11)))","v":0},{"$f":"(E11/6)*$AB$10","v":0},null,{"$f":"IF(ROUNDDOWN(AB11*3*6,0)>$E$10,$E$10,(ROUNDDOWN(AB11*3*6,0)))","v":0},{"$f":"IF(P11=0,0,(E11*F11/$P$10/100*$AE$10))","v":0},null,0,null,{"$f":"IF(ROUNDDOWN(AG11/4,0)>$E$10,$E$10,(ROUNDDOWN(AG11/4,0)))","v":0},null,0,{"$f":"ROUNDDOWN(D11*10,0)","v":0},null,{"$f":"ROUNDDOWN(AL11/10,0)","v":0},{"$f":"ROUNDDOWN(D11*4,0)","v":0},{"$f":"'Randlängen-Rund'!AC10","v":0},{"$f":"ROUNDDOWN(AO11/4,0)","v":0},{"$f":"IF(AM11+AP11>$E$10,$E$10,AM11+AP11)","v":0},{"$f":"IF(D11=0,\"\",ROUNDDOWN(D11/10+1,0))","v":""},null,{"$f":"IF(ROUNDDOWN(AS11*10,0)>$E$10,$E$10,ROUNDDOWN(AS11*10,0))","v":0},{"$f":"ROUNDDOWN(D11*2.5,0)","v":0},null,{"$f":"ROUNDDOWN(AV11/2.5,0)","v":0},{"$f":"D11","v":0},{"$f":"'Randlängen-Rund'!AC32","v":0},{"$f":"AY11/1","v":0},{"$f":"IF(AT11+AW11+AZ11>$E$10,$E$10,AT11+AW11+AZ11)","v":0},{"$f":"Berechnungstabellen!K312","v":0},{"$f":"IF(BB11=0,\"\",D11-BB11)","v":""},{"$f":"IF(D11>BB11,(D11-BB11)/BB11,\"\")","v":""},{"$f":"IF(BB11=0,\"\",IF(E11>BB11,E11-BB11,0))","v":""},{"$f":"IF($E11>$BB11,($E11-$BB11)/$BB11,\"\")","v":""}]
[null,null,null,null,null,null,{"$f":"D12-E12","v":0},{"$f":"IF(E12=0,0,G12/(C$2-C12))","v":0},{"$f":"IF(C12=0,0,IF(E12=0,0,1-(E12/D12)))","v":0},{"$f":"IF(B12=0,0,IF(B12<\"2021\",4,3))","v":0},null,{"$f":"IF(B12=0,0,IF(K12>J12,0,$E$10))","v":0},null,null,{"$f":"SUM(M12:N12)","v":0},{"$f":"IF(F12=0,0,IF(ROUNDDOWN(O12*P$10/F12,0)>$E$5,$E$5,(ROUNDDOWN(O12*P$10/F12,0))))","v":0},null,null,null,null,null,null,null,{"$f":"D12/500*2","v":0},null,{"$f":"IF(E12=0,0,IF(Y12>X12,P12,(Y12/X12*E12)))","v":0},{"$f":"(E12/6)*$AB$10","v":0},null,{"$f":"IF(ROUNDDOWN(AB12*3*6,0)>$E$10,$E$10,(ROUNDDOWN(AB12*3*6,0)))","v":0},{"$f":"IF(P12=0,0,(E12*F12/$P$10/100*$AE$10))","v":0},null,0,null,{"$f":"IF(ROUNDDOWN(AG12/4,0)>$E$10,$E$10,(ROUNDDOWN(AG12/4,0)))","v":0},null,0,{"$f":"ROUNDDOWN(D12*10,0)","v":0},null,{"$f":"ROUNDDOWN(AL12/10,0)","v":0},{"$f":"ROUNDDOWN(D12*4,0)","v":0},{"$f":"'Randlängen-Rund'!AC11","v":0},0,{"$f":"IF(AM12+AP12>$E$10,$E$10,AM12+AP12)","v":0},{"$f":"IF(D12=0,\"\",ROUNDDOWN(D12/10+1,0))","v":""},null,{"$f":"IF(ROUNDDOWN(AS12*10,0)>$E$10,$E$10,ROUNDDOWN(AS12*10,0))","v":0},{"$f":"ROUNDDOWN(D12*2.5,0)","v":0},null,0,{"$f":"D12","v":0},{"$f":"'Randlängen-Rund'!AC33","v":0},0,{"$f":"IF(AT12+AW12+AZ12>$E$10,$E$10,AT12+AW12+AZ12)","v":0},{"$f":"Berechnungstabellen!K313","v":0},{"$f":"IF(BB12=0,\"\",D12-BB12)","v":""},{"$f":"IF(D12>BB12,(D12-BB12)/BB12,\"\")","v":""},{"$f":"IF(BB12=0,\"\",IF(E12>BB12,E12-BB12,0))","v":""},{"$f":"IF($E12>$BB12,($E12-$BB12)/$BB12,\"\")","v":""}]
[null,null,null,null,null,null,0,0,0,0,null,0,null,null,{"$f":"SUM(M13:N13)","v":0},0,null,null,null,null,null,null,null,{"$f":"D13/500*2","v":0},null,0,{"$f":"(E13/6)*$AB$10","v":0},null,{"$f":"IF(ROUNDDOWN(AB13*3*6,0)>$E$10,$E$10,(ROUNDDOWN(AB13*3*6,0)))","v":0},{"$f":"IF(P13=0,0,(E13*F13/$P$10/100*$AE$10))","v":0},null,0,null,{"$f":"IF(ROUNDDOWN(AG13/4,0)>$E$10,$E$10,(ROUNDDOWN(AG13/4,0)))","v":0},null,0,{"$f":"ROUNDDOWN(D13*10,0)","v":0},null,{"$f":"ROUNDDOWN(AL13/10,0)","v":0},{"$f":"ROUNDDOWN(D13*4,0)","v":0},{"$f":"'Randlängen-Rund'!AC12","v":0},0,{"$f":"IF(AM13+AP13>$E$10,$E$10,AM13+AP13)","v":0},{"$f":"IF(D13=0,\"\",ROUNDDOWN(D13/10+1,0))","v":""},null,{"$f":"IF(ROUNDDOWN(AS13*10,0)>$E$10,$E$10,ROUNDDOWN(AS13*10,0))","v":0},0,null,0,{"$f":"D13","v":0},{"$f":"'Randlängen-Rund'!AC34","v":0},0,{"$f":"IF(AT13+AW13+AZ13>$E$10,$E$10,AT13+AW13+AZ13)","v":0},{"$f":"Berechnungstabellen!K314","v":0},{"$f":"IF(BB13=0,\"\",D13-BB13)","v":""},{"$f":"IF(D13>BB13,(D13-BB13)/BB13,\"\")","v":""},"",{"$f":"IF($E13>$BB13,($E13-$BB13)/$BB13,\"\")","v":""}]
[null,null,null,null,null,null,0,0,0,0,null,0,null,null,{"$f":"SUM(M14:N14)","v":0},0,null,null,null,null,null,null,null,{"$f":"D14/500*2","v":0},null,0,{"$f":"(E14/6)*$AB$10","v":0},null,{"$f":"IF(ROUNDDOWN(AB14*3*6,0)>$E$10,$E$10,(ROUNDDOWN(AB14*3*6,0)))","v":0},{"$f":"IF(P14=0,0,(E14*F14/$P$10/100*$AE$10))","v":0},null,0,null,{"$f":"IF(ROUNDDOWN(AG14/4,0)>$E$10,$E$10,(ROUNDDOWN(AG14/4,0)))","v":0},null,0,{"$f":"ROUNDDOWN(D14*10,0)","v":0},null,{"$f":"ROUNDDOWN(AL14/10,0)","v":0},{"$f":"ROUNDDOWN(D14*4,0)","v":0},{"$f":"'Randlängen-Rund'!AC13","v":0},0,{"$f":"IF(AM14+AP14>$E$10,$E$10,AM14+AP14)","v":0},{"$f":"IF(D14=0,\"\",ROUNDDOWN(D14/10+1,0))","v":""},null,{"$f":"IF(ROUNDDOWN(AS14*10,0)>$E$10,$E$10,ROUNDDOWN(AS14*10,0))","v":0},0,null,0,{"$f":"D14","v":0},{"$f":"'Randlängen-Rund'!AC35","v":0},0,{"$f":"IF(AT14+AW14+AZ14>$E$10,$E$10,AT14+AW14+AZ14)","v":0},{"$f":"Berechnungstabellen!K315","v":0},{"$f":"IF(BB14=0,\"\",D14-BB14)","v":""},{"$f":"IF(D14>BB14,(D14-BB14)/BB14,\"\")","v":""},"",{"$f":"IF($E14>$BB14,($E14-$BB14)/$BB14,\"\")","v":""}]
["Enten männl.",null,"max. Belegung je Stall:",null,3200,".",".",null,null,null,null,null,null,null,"max. kg / m²:",21,null,null,null,null,null,null,null,"mind. 2m/500 Tiere",null,null,"mind. ",0.33329999999999999," der notw. Fläche","mind. ",4,"m/100m²","mind. 4m²/Tier",null,null,"Enten männl."]
[null,null,null,null,null,null,{"$f":"D16-E16","v":0},{"$f":"IF(E16=0,0,G16/(C$2-C16))","v":0},{"$f":"IF(C16=0,0,IF(E16=0,0,1-(E16/D16)))","v":0},{"$f":"IF(B16=0,0,IF(B16<\"2021\",4,3))","v":0},null,{"$f":"IF(B16=0,0,IF(K16>J16,0,$E$15))","v":0},null,null,{"$f":"SUM(M16:N16)","v":0},{"$f":"IF(F16=0,0,IF(ROUNDDOWN(O16*P$15/F16,0)>$E$5,$E$5,(ROUNDDOWN(O16*P$15/F16,0))))","v":0},"Nicht relevant",null,null,"Nicht relevant",null,null,null,{"$f":"D16/500*2","v":0},null,{"$f":"IF(E16=0,0,IF(Y16>X16,P16,(Y16/X16*E16)))","v":0},{"$f":"(E16/6)*$AB$15","v":0},null,{"$f":"IF(ROUNDDOWN(AB16*3*6,0)>$E$15,$E$15,(ROUNDDOWN(AB16*3*6,0)))","v":0},{"$f":"IF(P16=0,0,(E16*F16/$P$15/100*$AE$15))","v":0},null,0,null,{"$f":"IF(ROUNDDOWN(AG16/4,0)>$E$15,$E$15,(ROUNDDOWN(AG16/4,0)))","v":0},null,0,{"$f":"ROUNDDOWN(D16*10,0)","v":0},null,{"$f":"ROUNDDOWN(AL16/10,0)","v":0},{"$f":"ROUNDDOWN(D16*4,0)","v":0},{"$f":"'Randlängen-Rund'!AC15","v":0},{"$f":"ROUNDDOWN(AO16/4,0)","v":0},{"$f":"IF(AM16+AP16>$E$15,$E$15,AM16+AP16)","v":0},{"$f":"IF(D16=0,\"\",ROUNDDOWN(D16/10+1,0))","v":""},null,{"$f":"IF(ROUNDDOWN(AS16*10,0)>$E$15,$E$15,ROUNDDOWN(AS16*10,0))","v":0},{"$f":"ROUNDDOWN(D16*2.5,0)","v":0},null,{"$f":"ROUNDDOWN(AV16/2.5,0)","v":0},{"$f":"D16","v":0},{"$f":"'Randlängen-Rund'!AC37","v":0},{"$f":"AY16/1","v":0},{"$f":"IF(AT16+AW16+AZ16>$E$15,$E$15,AT16+AW16+AZ16)","v":0},{"$f":"Berechnungstabellen!K317","v":0},{"$f":"IF(BB16=0,\"\",D16-BB16)","v":""},{"$f":"IF(D16>BB16,(D16-BB16)/BB16,\"\")","v":""},{"$f":"IF(BB16=0,\"\",IF(E16>BB16,E16-BB16,0))","v":""},{"$f":"IF($E16>$BB16,($E16-$BB16)/$BB16,\"\")","v":""}]
[null,null,null,null,null,null,{"$f":"D17-E17","v":0},{"$f":"IF(E17=0,0,G17/(C$2-C17))","v":0},{"$f":"IF(C17=0,0,IF(E17=0,0,1-(E17/D17)))","v":0},{"$f":"IF(B17=0,0,IF(B17<\"2021\",4,3))","v":0},null,{"$f":"IF(B17=0,0,IF(K17>J17,0,$E$15))","v":0},null,null,{"$f":"SUM(M17:N17)","v":0},{"$f":"IF(F17=0,0,IF(ROUNDDOWN(O17*P$15/F17,0)>$E$5,$E$5,(ROUNDDOWN(O17*P$15/F17,0))))","v":0},null,null,null,null,null,null,null,{"$f":"D17/500*2","v":0},null,{"$f":"IF(E17=0,0,IF(Y17>X17,P17,(Y17/X17*E17)))","v":0},{"$f":"(E17/6)*$AB$15","v":0},null,{"$f":"IF(ROUNDDOWN(AB17*3*6,0)>$E$15,$E$15,(ROUNDDOWN(AB17*3*6,0)))","v":0},{"$f":"IF(P17=0,0,(E17*F17/$P$15/100*$AE$15))","v":0},null,0,null,{"$f":"IF(ROUNDDOWN(AG17/4,0)>$E$15,$E$15,(ROUNDDOWN(AG17/4,0)))","v":0},null,0,{"$f":"ROUNDDOWN(D17*10,0)","v":0},null,0,{"$f":"ROUNDDOWN(D17*4,0)","v":0},{"$f":"'Randlängen-Rund'!AC16","v":0},0,{"$f":"IF(AM17+AP17>$E$15,$E$15,AM17+AP17)","v":0},{"$f":"IF(D17=0,\"\",ROUNDDOWN(D17/10+1,0))","v":""},null,{"$f":"IF(ROUNDDOWN(AS17*10,0)>$E$15,$E$15,ROUNDDOWN(AS17*10,0))","v":0},{"$f":"ROUNDDOWN(D17*2.5,0)","v":0},null,0,{"$f":"D17","v":0},{"$f":"'Randlängen-Rund'!AC38","v":0},0,{"$f":"IF(AT17+AW17+AZ17>$E$15,$E$15,AT17+AW17+AZ17)","v":0},{"$f":"Berechnungstabellen!K318","v":0},{"$f":"IF(BB17=0,\"\",D17-BB17)","v":""},{"$f":"IF(D17>BB17,(D17-BB17)/BB17,\"\")","v":""},{"$f":"IF(BB17=0,\"\",IF(E17>BB17,E17-BB17,0))","v":""},{"$f":"IF($E17>$BB17,($E17-$BB17)/$BB17,\"\")","v":""}]
[null,null,null,null,null,null,0,0,0,0,null,0,null,null,{"$f":"SUM(M18:N18)","v":0},0,null,null,null,null,null,null,null,{"$f":"D18/500*2","v":0},null,0,{"$f":"(E18/6)*$AB$15","v":0},null,{"$f":"IF(ROUNDDOWN(AB18*3*6,0)>$E$15,$E$15,(ROUNDDOWN(AB18*3*6,0)))","v":0},{"$f":"IF(P18=0,0,(E18*F18/$P$15/100*$AE$15))","v":0},null,0,null,{"$f":"IF(ROUNDDOWN(AG18/4,0)>$E$15,$E$15,(ROUNDDOWN(AG18/4,0)))","v":0},null,0,{"$f":"ROUNDDOWN(D18*10,0)","v":0},null,0,{"$f":"ROUNDDOWN(D18*4,0)","v":0},{"$f":"'Randlängen-Rund'!AC17","v":0},0,{"$f":"IF(AM18+AP18>$E$15,$E$15,AM18+AP18)","v":0},{"$f":"IF(D18=0,\"\",ROUNDDOWN(D18/10+1,0))","v":""},null,{"$f":"IF(ROUNDDOWN(AS18*10,0)>$E$15,$E$15,ROUNDDOWN(AS18*10,0))","v":0},0,null,0,{"$f":"D18","v":0},{"$f":"'Randlängen-Rund'!AC39","v":0},0,{"$f":"IF(AT18+AW18+AZ18>$E$15,$E$15,AT18+AW18+AZ18)","v":0},{"$f":"Berechnungstabellen!K319","v":0},{"$f":"IF(BB18=0,\"\",D18-BB18)","v":""},{"$f":"IF(D18>BB18,(D18-BB18)/BB18,\"\")","v":""},"",{"$f":"IF($E18>$BB18,($E18-$BB18)/$BB18,\"\")","v":""}]
[null,null,null,null,null,null,0,0,0,0,null,0,null,null,{"$f":"SUM(M19:N19)","v":0},0,null,null,null,null,null,null,null,{"$f":"D19/500*2","v":0},null,0,{"$f":"(E19/6)*$AB$15","v":0},null,{"$f":"IF(ROUNDDOWN(AB19*3*6,0)>$E$15,$E$15,(ROUNDDOWN(AB19*3*6,0)))","v":0},{"$f":"IF(P19=0,0,(E19*F19/$P$15/100*$AE$15))","v":0},null,0,null,{"$f":"IF(ROUNDDOWN(AG19/4,0)>$E$15,$E$15,(ROUNDDOWN(AG19/4,0)))","v":0},null,0,{"$f":"ROUNDDOWN(D19*10,0)","v":0},null,0,{"$f":"ROUNDDOWN(D19*4,0)","v":0},{"$f":"'Randlängen-Rund'!AC18","v":0},0,{"$f":"IF(AM19+AP19>$E$15,$E$15,AM19+AP19)","v":0},{"$f":"IF(D19=0,\"\",ROUNDDOWN(D19/10+1,0))","v":""},null,{"$f":"IF(ROUNDDOWN(AS19*10,0)>$E$15,$E$15,ROUNDDOWN(AS19*10,0))","v":0},0,null,0,{"$f":"D19","v":0},{"$f":"'Randlängen-Rund'!AC40","v":0},0,{"$f":"IF(AT19+AW19+AZ19>$E$15,$E$15,AT19+AW19+AZ19)","v":0},{"$f":"Berechnungstabellen!K320","v":0},{"$f":"IF(BB19=0,\"\",D19-BB19)","v":""},{"$f":"IF(D19>BB19,(D19-BB19)/BB19,\"\")","v":""},"",{"$f":"IF($E19>$BB19,($E19-$BB19)/$BB19,\"\")","v":""}]
["Perl-hühner",null,"max. Belegung je Stall:",null,5200,".",".",null,null,null,null,null,null,null,"max. kg / m²:",21,"mind. ",0.05,"m / Tier","mind. ",25,"cm2 / Tier",null,"mind. 2m/500 Tiere",null,null,"mind. ",0.33329999999999999," der notw. Fläche","mind. ",4,"m/100m²","mind. 4m²/Tier",null,null,"Perl-hühner"]
[null,null,null,null,null,null,{"$f":"D21-E21","v":0},{"$f":"IF(E21=0,0,G21/(C$2-C21))","v":0},{"$f":"IF(C21=0,0,IF(E21=0,0,1-(E21/D21)))","v":0},{"$f":"IF(B21=0,0,IF(B21<\"2021\",4,3))","v":0},null,{"$f":"IF(B21=0,0,IF(K21>J21,0,$E$20))","v":0},null,null,{"$f":"SUM(M21:N21)","v":0},{"$f":"IF(F21=0,0,IF(ROUNDDOWN(O21*P$20/F21,0)>$E$5,$E$5,(ROUNDDOWN(O21*P$20/F21,0))))","v":0},{"$f":"E21*$R$20","v":0},null,{"$f":"IF(ROUNDDOWN(R21/$R$20,0)>$E$5,$E$5,(ROUNDDOWN(R21/$R$20,0)))","v":0},{"$f":"$E21*$U$20","v":0},null,{"$f":"IF(ROUNDDOWN(U21/$U$20,0)>$E$5,$E$5,(ROUNDDOWN(U21/$U$20,0)))","v":0},{"$f":"S21+V21","v":0},{"$f":"D21/500*2","v":0},null,{"$f":"IF(E21=0,0,IF(Y21>X21,P21,(Y21/X21*E21)))","v":0},{"$f":"(E21/6)*$AB$20","v":0},null,{"$f":"IF(ROUNDDOWN(AB21*3*6,0)>$E$20,$E$20,(ROUNDDOWN(AB21*3*6,0)))","v":0},{"$f":"IF(P21=0,0,(E21*F21/$P$20/100*$AE$20))","v":0},null,0,null,{"$f":"IF(ROUNDDOWN(AG21/4,0)>$E$20,$E$20,(ROUNDDOWN(AG21/4,0)))","v":0},null,0,{"$f":"ROUNDDOWN(D21*10,0)","v":0},null,{"$f":"ROUNDDOWN(AL21/10,0)","v":0},{"$f":"ROUNDDOWN(D21*4,0)","v":0},{"$f":"'Randlängen-Rund'!AC20","v":0},{"$f":"ROUNDDOWN(AO21/4,0)","v":0},{"$f":"IF(AM21+AP21>$E$20,$E$20,AM21+AP21)","v":0},{"$f":"IF(D21=0,\"\",ROUNDDOWN(D21/10+1,0))","v":""},null,{"$f":"IF(ROUNDDOWN(AS21*10,0)>$E$20,$E$20,ROUNDDOWN(AS21*10,0))","v":0},{"$f":"ROUNDDOWN(D21*2.5,0)","v":0},null,{"$f":"ROUNDDOWN(AV21/2.5,0)","v":0},{"$f":"D21","v":0},{"$f":"'Randlängen-Rund'!AC42","v":0},{"$f":"AY21/1","v":0},{"$f":"IF(AT21+AW21+AZ21>$E$20,$E$20,AT21+AW21+AZ21)","v":0},{"$f":"Berechnungstabellen!K322","v":0},{"$f":"IF(BB21=0,\"\",D21-BB21)","v":""},{"$f":"IF(D21>BB21,(D21-BB21)/BB21,\"\")","v":""},{"$f":"IF(BB21=0,\"\",IF(E21>BB21,E21-BB21,0))","v":""},{"$f":"IF($E21>$BB21,($E21-$BB21)/$BB21,\"\")","v":""}]
[null,null,null,null,null,null,{"$f":"D22-E22","v":0},{"$f":"IF(E22=0,0,G22/(C$2-C22))","v":0},{"$f":"IF(C22=0,0,IF(E22=0,0,1-(E22/D22)))","v":0},{"$f":"IF(B22=0,0,IF(B22<\"2021\",4,3))","v":0},null,{"$f":"IF(B22=0,0,IF(K22>J22,0,$E$20))","v":0},null,null,{"$f":"SUM(M22:N22)","v":0},{"$f":"IF(F22=0,0,IF(ROUNDDOWN(O22*P$20/F22,0)>$E$5,$E$5,(ROUNDDOWN(O22*P$20/F22,0))))","v":0},{"$f":"E22*$R$20","v":0},null,{"$f":"IF(ROUNDDOWN(R22/$R$20,0)>$E$20,$E$20,(ROUNDDOWN(R22/$R$20,0)))","v":0},{"$f":"$E22*$U$20","v":0},null,{"$f":"IF(ROUNDDOWN(U22/$U$20,0)>$E$5,$E$5,(ROUNDDOWN(U22/$U$20,0)))","v":0},{"$f":"S22+V22","v":0},{"$f":"D22/500*2","v":0},null,{"$f":"IF(E22=0,0,IF(Y22>X22,P22,(Y22/X22*E22)))","v":0},{"$f":"(E22/6)*$AB$20","v":0},null,{"$f":"IF(ROUNDDOWN(AB22*3*6,0)>$E$20,$E$20,(ROUNDDOWN(AB22*3*6,0)))","v":0},{"$f":"IF(P22=0,0,(E22*F22/$P$20/100*$AE$20))","v":0},null,0,null,{"$f":"IF(ROUNDDOWN(AG22/4,0)>$E$20,$E$20,(ROUNDDOWN(AG22/4,0)))","v":0},null,0,{"$f":"ROUNDDOWN(D22*10,0)","v":0},null,0,{"$f":"ROUNDDOWN(D22*4,0)","v":0},{"$f":"'Randlängen-Rund'!AC21","v":0},0,{"$f":"IF(AM22+AP22>$E$20,$E$20,AM22+AP22)","v":0},{"$f":"IF(D22=0,\"\",ROUNDDOWN(D22/10+1,0))","v":""},null,{"$f":"IF(ROUNDDOWN(AS22*10,0)>$E$20,$E$20,ROUNDDOWN(AS22*10,0))","v":0},{"$f":"ROUNDDOWN(D22*2.5,0)","v":0},null,0,{"$f":"D22","v":0},{"$f":"'Randlängen-Rund'!AC43","v":0},0,{"$f":"IF(AT22+AW22+AZ22>$E$20,$E$20,AT22+AW22+AZ22)","v":0},{"$f":"Berechnungstabellen!K323","v":0},{"$f":"IF(BB22=0,\"\",D22-BB22)","v":""},{"$f":"IF(D22>BB22,(D22-BB22)/BB22,\"\")","v":""},{"$f":"IF(BB22=0,\"\",IF(E22>BB22,E22-BB22,0))","v":""},{"$f":"IF($E22>$BB22,($E22-$BB22)/$BB22,\"\")","v":""}]
[null,null,null,null,null,null,0,0,0,0,null,0,null,null,{"$f":"SUM(M23:N23)","v":0},0,0,null,{"$f":"IF(ROUNDDOWN(R23/$R$20,0)>$E$20,$E$20,(ROUNDDOWN(R23/$R$20,0)))","v":0},0,null,0,0,{"$f":"D23/500*2","v":0},null,0,{"$f":"(E23/6)*$AB$20","v":0},null,{"$f":"IF(ROUNDDOWN(AB23*3*6,0)>$E$20,$E$20,(ROUNDDOWN(AB23*3*6,0)))","v":0},{"$f":"IF(P23=0,0,(E23*F23/$P$20/100*$AE$20))","v":0},null,0,null,{"$f":"IF(ROUNDDOWN(AG23/4,0)>$E$20,$E$20,(ROUNDDOWN(AG23/4,0)))","v":0},null,0,{"$f":"ROUNDDOWN(D23*10,0)","v":0},null,0,{"$f":"ROUNDDOWN(D23*4,0)","v":0},{"$f":"'Randlängen-Rund'!AC22","v":0},0,{"$f":"IF(AM23+AP23>$E$20,$E$20,AM23+AP23)","v":0},{"$f":"IF(D23=0,\"\",ROUNDDOWN(D23/10+1,0))","v":""},null,{"$f":"IF(ROUNDDOWN(AS23*10,0)>$E$20,$E$20,ROUNDDOWN(AS23*10,0))","v":0},0,null,0,{"$f":"D23","v":0},{"$f":"'Randlängen-Rund'!AC44","v":0},0,{"$f":"IF(AT23+AW23+AZ23>$E$20,$E$20,AT23+AW23+AZ23)","v":0},{"$f":"Berechnungstabellen!K324","v":0},{"$f":"IF(BB23=0,\"\",D23-BB23)","v":""},{"$f":"IF(D23>BB23,(D23-BB23)/BB23,\"\")","v":""},"",{"$f":"IF($E23>$BB23,($E23-$BB23)/$BB23,\"\")","v":""}]
[null,null,null,null,null,null,0,0,0,0,null,0,null,null,{"$f":"SUM(M24:N24)","v":0},0,0,null,{"$f":"IF(ROUNDDOWN(R24/$R$20,0)>$E$20,$E$20,(ROUNDDOWN(R24/$R$20,0)))","v":0},0,null,0,0,{"$f":"D24/500*2","v":0},null,0,{"$f":"(E24/6)*$AB$20","v":0},null,{"$f":"IF(ROUNDDOWN(AB24*3*6,0)>$E$20,$E$20,(ROUNDDOWN(AB24*3*6,0)))","v":0},{"$f":"IF(P24=0,0,(E24*F24/$P$20/100*$AE$20))","v":0},null,0,null,{"$f":"IF(ROUNDDOWN(AG24/4,0)>$E$20,$E$20,(ROUNDDOWN(AG24/4,0)))","v":0},null,0,{"$f":"ROUNDDOWN(D24*10,0)","v":0},null,0,{"$f":"ROUNDDOWN(D24*4,0)","v":0},{"$f":"'Randlängen-Rund'!AC23","v":0},0,{"$f":"IF(AM24+AP24>$E$20,$E$20,AM24+AP24)","v":0},{"$f":"IF(D24=0,\"\",ROUNDDOWN(D24/10+1,0))","v":""},null,{"$f":"IF(ROUNDDOWN(AS24*10,0)>$E$20,$E$20,ROUNDDOWN(AS24*10,0))","v":0},0,null,0,{"$f":"D24","v":0},{"$f":"'Randlängen-Rund'!AC45","v":0},0,{"$f":"IF(AT24+AW24+AZ24>$E$20,$E$20,AT24+AW24+AZ24)","v":0},{"$f":"Berechnungstabellen!K325","v":0},{"$f":"IF(BB24=0,\"\",D24-BB24)","v":""},{"$f":"IF(D24>BB24,(D24-BB24)/BB24,\"\")","v":""},"",{"$f":"IF($E24>$BB24,($E24-$BB24)/$BB24,\"\")","v":""}]
[]
[]
["Geprüfte Maßangaben:"]
[]
["Anmerkungen / Kommentare"]

{"sheet":"Randlängen-Rund","index":12,"n_rows":45,"n_cols":29,"rows_kept":45,"cut":false,"hidden":false,"merged":[]}
["1. Ermittlung Rand-Länge Legehennen",null,null,null,null,"2. Ermittlung Rand-Länge Junghennen-Bruderhähne",null,null,null,null,"3. Ermittlung Rand-Länge Masthähnchen",null,null,null,null,"4. Ermittlung Rand-Länge Kapaune / Poularden",null,null,null,null,"5. Ermittlung Rand-Länge Mastputen",null,null,null,null,"6. Ermittlung Rand-Länge Mastgeflügel-sonstiges"]
["A) Futter",null,null,3.1415926500000002,null,"A) Futter",null,null,3.1415926500000002,null,"A) Futter",null,null,3.1415926500000002,null,"A) Futter",null,null,3.1415926500000002,null,"A) Futter",null,null,3.1415926500000002,null,"A) Futter",null,null,3.1415926500000002]
["Bezeichng. Stall","Durch-messer Rundtrog (cm)","Anzahl","Randlänge (cm)",null,"Bezeichng. Stall","Durch-messer Rundtrog (cm)","Anzahl","Randlänge (cm)",null,"Bezeichng. Stall","Durch-messer Rundtrog (cm)","Anzahl","Randlänge (cm)",null,"Bezeichng. Stall","Durch-messer Rundtrog (cm)","Anzahl","Randlänge (cm)",null,"Bezeichng. Stall","Durch-messer Rundtrog (cm)","Anzahl","Randlänge (cm)",null,"Bezeichng. Stall","Durch-messer Rundtrog (cm)","Anzahl","Randlänge (cm)"]
[{"$f":"Legehennen!A6","v":0},35,200,{"$f":"B4*D$2*C4","v":21991.148550000002},null,{"$f":"'Junghennen-Bruderhähne'!A6","v":0},null,null,{"$f":"G4*$D$2*H4","v":0},null,{"$f":"Masthähnchen!A6","v":0},null,null,{"$f":"L4*D$2*M4","v":0},null,{"$f":"Masthähnchen!A26","v":0},null,null,{"$f":"Q4*$D$2*R4","v":0},null,{"$f":"Mastputen!A6","v":0},null,null,{"$f":"V4*D$2*W4","v":0},null,{"$f":"Mastgeflügel!A5","v":"Gänse"}]
[{"$f":"Legehennen!A7","v":0},null,null,{"$f":"B5*D$2*C5","v":0},null,{"$f":"'Junghennen-Bruderhähne'!A7","v":0},null,null,{"$f":"G5*$D$2*H5","v":0},null,{"$f":"Masthähnchen!A7","v":0},null,null,0,null,{"$f":"Masthähnchen!A27","v":0},null,null,{"$f":"Q5*$D$2*R5","v":0},null,{"$f":"Mastputen!A7","v":0},null,null,0,null,{"$f":"Mastgeflügel!A6","v":0},null,null,{"$f":"AA5*D$2*AB5","v":0}]
[{"$f":"Legehennen!A8","v":0},null,null,0,null,{"$f":"'Junghennen-Bruderhähne'!A8","v":0},null,null,0,null,{"$f":"Masthähnchen!A8","v":0},null,null,0,null,{"$f":"Masthähnchen!A28","v":0},null,null,0,null,{"$f":"Mastputen!A8","v":0},null,null,0,null,{"$f":"Mastgeflügel!A7","v":0},null,null,{"$f":"AA6*D$2*AB6","v":0}]
[{"$f":"Legehennen!A9","v":0},null,null,0,null,{"$f":"'Junghennen-Bruderhähne'!A9","v":0},null,null,0,null,{"$f":"Masthähnchen!A9","v":0},null,null,0,null,{"$f":"Masthähnchen!A29","v":0},null,null,0,null,{"$f":"Mastputen!A9","v":0},null,null,0,null,{"$f":"Mastgeflügel!A8","v":0},null,null,{"$f":"AA7*D$2*AB7","v":0}]
[{"$f":"Legehennen!A10","v":0},null,null,0,null,{"$f":"'Junghennen-Bruderhähne'!A10","v":0},null,null,0,null,{"$f":"Masthähnchen!A10","v":0},null,null,0,null,{"$f":"Masthähnchen!A30","v":0},null,null,0,null,{"$f":"Mastputen!A10","v":0},null,null,0,null,{"$f":"Mastgeflügel!A9","v":0},null,null,{"$f":"AA8*D$2*AB8","v":0}]
[{"$f":"Legehennen!A11","v":0},null,null,0,null,{"$f":"'Junghennen-Bruderhähne'!A11","v":0},null,null,0,null,{"$f":"Masthähnchen!A11","v":0},null,null,0,null,{"$f":"Masthähnchen!A31","v":0},null,null,0,null,{"$f":"Mastputen!A11","v":0},null,null,0,null,{"$f":"Mastgeflügel!A10","v":"Enten wbl."}]
[{"$f":"Legehennen!A12","v":0},null,null,0,null,{"$f":"'Junghennen-Bruderhähne'!A12","v":0},null,null,0,null,{"$f":"Masthähnchen!A12","v":0},null,null,0,null,{"$f":"Masthähnchen!A32","v":0},null,null,0,null,{"$f":"Mastputen!A12","v":0},null,null,0,null,{"$f":"Mastgeflügel!A11","v":0},null,null,{"$f":"AA10*D$2*AB10","v":0}]
[{"$f":"Legehennen!A13","v":0},null,null,0,null,{"$f":"'Junghennen-Bruderhähne'!A13","v":0},null,null,0,null,{"$f":"Masthähnchen!A13","v":0},null,null,0,null,{"$f":"Masthähnchen!A33","v":0},null,null,0,null,{"$f":"Mastputen!A13","v":0},null,null,0,null,{"$f":"Mastgeflügel!A12","v":0},null,null,{"$f":"AA11*D$2*AB11","v":0}]
[{"$f":"Legehennen!A14","v":0},null,null,0,null,{"$f":"'Junghennen-Bruderhähne'!A14","v":"Bewegl. Ställe"},null,null,null,null,{"$f":"Masthähnchen!A14","v":"Bewegl. Ställe"},null,null,null,null,{"$f":"Masthähnchen!A36","v":"Poularden"},null,null,null,null,{"$f":"Mastputen!A14","v":"Bewegl. Ställe"},null,null,0,null,{"$f":"Mastgeflügel!A13","v":0},null,null,{"$f":"AA12*D$2*AB12","v":0}]
[{"$f":"Legehennen!A15","v":0},null,null,0,null,{"$f":"'Junghennen-Bruderhähne'!A15","v":0},null,null,{"$f":"G13*$D$2*H13","v":0},null,{"$f":"Masthähnchen!A15","v":0},null,null,{"$f":"L13*D$2*M13","v":0},null,{"$f":"Masthähnchen!A37","v":0},null,null,0,null,{"$f":"Mastputen!A15","v":0},null,null,0,null,{"$f":"Mastgeflügel!A14","v":0},null,null,{"$f":"AA13*D$2*AB13","v":0}]
[{"$f":"Legehennen!A16","v":0},null,null,0,null,{"$f":"'Junghennen-Bruderhähne'!A16","v":0},null,null,{"$f":"G14*$D$2*H14","v":0},null,{"$f":"Masthähnchen!A16","v":0},null,null,0,null,{"$f":"Masthähnchen!A38","v":0},null,null,0,null,{"$f":"Mastputen!A16","v":0},null,null,0,null,{"$f":"Mastgeflügel!A15","v":"Enten männl."}]
[{"$f":"Legehennen!A17","v":0},null,null,0,null,{"$f":"'Junghennen-Bruderhähne'!A17","v":0},null,null,0,null,{"$f":"Masthähnchen!A17","v":0},null,null,0,null,{"$f":"Masthähnchen!A39","v":0},null,null,0,null,{"$f":"Mastputen!A17","v":0},null,null,0,null,{"$f":"Mastgeflügel!A16","v":0},null,null,{"$f":"AA15*D$2*AB15","v":0}]
[{"$f":"Legehennen!A18","v":0},null,null,0,null,{"$f":"'Junghennen-Bruderhähne'!A18","v":0},null,null,0,null,{"$f":"Masthähnchen!A18","v":0},null,null,0,null,{"$f":"Masthähnchen!A40","v":0},null,null,0,null,{"$f":"Mastputen!A18","v":0},null,null,0,null,{"$f":"Mastgeflügel!A17","v":0},null,null,{"$f":"AA16*D$2*AB16","v":0}]
[{"$f":"Legehennen!A19","v":0},null,null,0,null,{"$f":"'Junghennen-Bruderhähne'!A19","v":0},null,null,0,null,{"$f":"Masthähnchen!A19","v":0},null,null,0,null,{"$f":"Masthähnchen!A41","v":0},null,null,0,null,{"$f":"Mastputen!A19","v":0},null,null,0,null,{"$f":"Mastgeflügel!A18","v":0},null,null,{"$f":"AA17*D$2*AB17","v":0}]
[{"$f":"Legehennen!A20","v":0},null,null,0,null,{"$f":"'Junghennen-Bruderhähne'!A20","v":0},null,null,0,null,{"$f":"Masthähnchen!A20","v":0},null,null,0,null,{"$f":"Masthähnchen!A42","v":0},null,null,0,null,{"$f":"Mastputen!A20","v":0},null,null,0,null,{"$f":"Mastgeflügel!A19","v":0},null,null,{"$f":"AA18*D$2*AB18","v":0}]
[{"$f":"Legehennen!A21","v":0},null,null,0,null,{"$f":"'Junghennen-Bruderhähne'!A21","v":0},null,null,0,null,{"$f":"Masthähnchen!A21","v":0},null,null,0,null,{"$f":"Masthähnchen!A43","v":0},null,null,0,null,{"$f":"Mastputen!A21","v":0},null,null,0,null,{"$f":"Mastgeflügel!A20","v":"Perl-hühner"}]
[{"$f":"Legehennen!A22","v":0},null,null,0,null,{"$f":"'Junghennen-Bruderhähne'!A22","v":0},null,null,0,null,{"$f":"Masthähnchen!A22","v":0},null,null,0,null,{"$f":"Masthähnchen!A44","v":0},null,null,0,null,{"$f":"Mastputen!A22","v":0},null,null,0,null,{"$f":"Mastgeflügel!A21","v":0},null,null,{"$f":"AA20*D$2*AB20","v":0}]
[null,null,null,null,null,{"$f":"'Junghennen-Bruderhähne'!A23","v":0},null,null,0,null,{"$f":"Masthähnchen!A23","v":0},null,null,0,null,{"$f":"Masthähnchen!A45","v":0},null,null,0,null,{"$f":"Mastputen!A23","v":0},null,null,0,null,{"$f":"Mastgeflügel!A22","v":0},null,null,{"$f":"AA21*D$2*AB21","v":0}]
[null,null,null,null,null,null,null,null,null,null,null,null,null,null,null,null,null,null,null,null,null,null,null,null,null,{"$f":"Mastgeflügel!A23","v":0},null,null,0]
[null,null,null,null,null,null,null,null,null,null,null,null,null,null,null,null,null,null,null,null,null,null,null,null,null,{"$f":"Mastgeflügel!A24","v":0},null,null,0]
["B) Tränken",null,null,null,null,"B) Tränken",null,null,null,null,"B) Tränken",null,null,null,null,"B) Tränken",null,null,null,null,"B) Tränken",null,null,null,null,"B) Tränken"]
["Bezeichng. Stall","Durch-messer Rundtränke (cm)","Anzahl","Randlänge (cm)",null,"Bezeichng. Stall","Durch-messer Rundtränke (cm)","Anzahl","Randlänge (cm)",null,"Bezeichng. Stall","Durch-messer Rundtränke (cm)","Anzahl","Randlänge (cm)",null,"Bezeichng. Stall","Durch-messer Rundtränke (cm)","Anzahl","Randlänge (cm)",null,"Bezeichng. Stall","Durch-messer Rundtränke (cm)","Anzahl","Randlänge (cm)",null,"Bezeichng. Stall","Durch-messer Rundtrog (cm)","Anzahl","Randlänge (cm)"]
[{"$f":"A4","v":0},30,200,{"$f":"B26*D$2*C26","v":18849.555900000003},null,{"$f":"F4","v":0},null,null,{"$f":"G26*$D$2*H26","v":0},null,{"$f":"K4","v":0},null,null,{"$f":"L26*D$2*M26","v":0},null,{"$f":"P4","v":0},null,null,{"$f":"Q26*$D$2*R26","v":0},null,{"$f":"U4","v":0},null,null,{"$f":"V26*D$2*W26","v":0},null,{"$f":"Z4","v":"Gänse"}]
[{"$f":"A5","v":0},null,null,{"$f":"B27*D$2*C27","v":0},null,{"$f":"F5","v":0},null,null,{"$f":"G27*$D$2*H27","v":0},null,{"$f":"K5","v":0},null,null,0,null,{"$f":"P5","v":0},null,null,{"$f":"Q27*$D$2*R27","v":0},null,{"$f":"U5","v":0},null,null,0,null,{"$f":"Z5","v":0},null,null,{"$f":"AA27*D$2*AB27","v":0}]
[0,null,null,0,null,0,null,null,0,null,0,null,null,0,null,0,null,null,0,null,0,null,null,0,null,0,null,null,{"$f":"AA28*D$2*AB28","v":0}]
[0,null,null,0,null,0,null,null,0,null,0,null,null,0,null,0,null,null,0,null,0,null,null,0,null,0,null,null,{"$f":"AA29*D$2*AB29","v":0}]
[0,null,null,0,null,0,null,null,0,null,0,null,null,0,null,0,null,null,0,null,0,null,null,0,null,0,null,null,{"$f":"AA30*D$2*AB30","v":0}]
[0,null,null,0,null,0,null,null,0,null,0,null,null,0,null,0,null,null,0,null,0,null,null,0,null,"Enten wbl."]
[0,null,null,0,null,0,null,null,0,null,0,null,null,0,null,0,null,null,0,null,0,null,null,0,null,0,null,null,{"$f":"AA32*D$2*AB32","v":0}]
[0,null,null,0,null,0,null,null,0,null,0,null,null,0,null,0,null,null,0,null,0,null,null,0,null,0,null,null,{"$f":"AA33*D$2*AB33","v":0}]
[0,null,null,0,null,"Bewegl. Ställe",null,null,null,null,"Bewegl. Ställe",null,null,null,null,"Poularden",null,null,null,null,"Bewegl. Ställe",null,null,0,null,0,null,null,{"$f":"AA34*D$2*AB34","v":0}]
[0,null,null,0,null,0,null,null,{"$f":"G35*$D$2*H35","v":0},null,0,null,null,{"$f":"L35*D$2*M35","v":0},null,0,null,null,0,null,0,null,null,0,null,0,null,null,{"$f":"AA35*D$2*AB35","v":0}]
[0,null,null,0,null,0,null,null,{"$f":"G36*$D$2*H36","v":0},null,0,null,null,0,null,0,null,null,0,null,0,null,null,0,null,"Enten männl."]
[0,null,null,0,null,0,null,null,0,null,0,null,null,0,null,0,null,null,0,null,0,null,null,0,null,0,null,null,{"$f":"AA37*D$2*AB37","v":0}]
[0,null,null,0,null,0,null,null,{"$f":"G38*$D$2*H38","v":0},null,0,null,null,0,null,0,null,null,0,null,0,null,null,0,null,0,null,null,{"$f":"AA38*D$2*AB38","v":0}]
[0,null,null,0,null,0,null,null,0,null,0,null,null,0,null,0,null,null,0,null,0,null,null,0,null,0,null,null,{"$f":"AA39*D$2*AB39","v":0}]
[0,null,null,0,null,0,null,null,0,null,0,null,null,0,null,0,null,null,0,null,0,null,null,0,null,0,null,null,{"$f":"AA40*D$2*AB40","v":0}]
[0,null,null,0,null,0,null,null,0,null,0,null,null,0,null,0,null,null,0,null,0,null,null,0,null,"Perl-hühner"]
[0,null,null,0,null,0,null,null,0,null,0,null,null,0,null,0,null,null,0,null,0,null,null,0,null,0,null,null,{"$f":"AA42*D$2*AB42","v":0}]
[null,null,null,null,null,0,null,null,0,null,0,null,null,0,null,0,null,null,0,null,0,null,null,0,null,0,null,null,{"$f":"AA43*D$2*AB43","v":0}]
[null,null,null,null,null,null,null,null,null,null,null,null,null,null,null,null,null,null,null,null,null,null,null,null,null,0,null,null,0]
[null,null,null,null,null,null,null,null,null,null,null,null,null,null,null,null,null,null,null,null,null,null,null,null,null,0,null,null,0]

{"sheet":"Berechnungstabellen","index":13,"n_rows":326,"n_cols":19,"rows_kept":326,"cut":false,"hidden":true,"merged":[[129,0,129,1],[130,0,130,1],[131,0,131,1],[132,0,132,1],[126,0,126,1],[127,0,127,1],[128,0,128,1],[118,0,118,1],[119,0,119,1],[120,0,120,1],[121,0,121,1],[122,0,122,1],[123,0,123,1],[124,0,124,1],[114,0,114,1],[115,0,115,1],[116,0,116,1],[108,0,108,1],[110,0,110,1],[111,0,111,1],[112,0,112,1],[113,0,113,1],[103,0,103,1],[104,0,104,1],[105,0,105,1],[106,0,106,1],[107,0,107,1],[97,0,97,1],[98,0,98,1],[99,0,99,1],[100,0,100,1],[102,0,102,1],[91,0,91,1],[92,0,92,1],[94,0,94,1],[95,0,95,1],[96,0,96,1],[88,0,88,1],[89,0,89,1],[90,0,90,1],[47,0,47,1],[48,0,48,1],[58,0,58,1],[59,0,59,1],[69,0,69,1],[52,0,52,1],[82,0,82,1],[57,0,57,1],[60,0,60,1],[68,0,68,1],[71,0,71,1],[79,0,79,1],[70,0,70,1],[80,0,80,1],[81,0,81,1],[77,0,77,1],[160,0,160,1],[161,0,161,1],[162,0,162,1],[163,0,163,1],[165,0,165,1],[155,0,155,1],[156,0,156,1],[157,0,157,1],[158,0,158,1],[159,0,159,1],[152,0,152,1],[153,0,153,1],[151,0,151,1],[145,0,145,1],[146,0,146,1],[147,0,147,1],[148,0,148,1],[149,0,149,1],[150,0,150,1],[166,0,166,1],[167,0,167,1],[168,0,168,1],[169,0,169,1],[170,0,170,1],[180,0,180,1],[181,0,181,1],[171,0,171,1],[172,0,172,1],[173,0,173,1],[175,0,175,1],[176,0,176,1],[177,0,177,1],[178,0,178,1],[179,0,179,1],[193,0,193,1],[188,0,188,1],[189,0,189,1],[190,0,190,1],[191,0,191,1],[192,0,192,1],[182,0,182,1],[183,0,183,1],[185,0,185,1],[186,0,186,1],[187,0,187,1],[135,0,135,1],[136,0,136,1],[137,0,137,1],[138,0,138,1],[139,0,139,1],[140,0,140,1],[41,0,41,1],[40,0,40,1],[44,0,44,1],[43,0,43,1],[76,0,76,1],[73,0,73,1],[74,0,74,1],[55,0,55,1],[62,0,62,1],[63,0,63,1],[65,0,65,1],[66,0,66,1],[46,0,46,1],[49,0,49,1],[54,0,54,1],[51,0,51,1],[86,0,86,1],[87,0,87,1]]}
["1. Säugetiere",null,null,null,null,null,null,null,null,null,null,"N max / ha","N Betrieb"]
["Tiergruppe",null,"Box-nummer(n) lt. Stall-plan","max. Tierzahl \nStallflächen/-Plätze","max. Tierzahl \nStallboden","Liegeplätze","max. Tierzahl \nAußen-flächen","max. Tierzahl \nÜberdachung",null,null,null,170,{"$f":"M12+M43+M46+M51+M94+M142+M155+N216+N280+N302+N311+N316+N321+N326","v":0},"1 DE =",80,"kg N",{"$f":"CONCATENATE(L2,\" kg N entspr. \")","v":"170 kg N entspr. "},{"$f":"L2/O2","v":2.125},"DE"]
["Rinder",{"$f":"CONCATENATE(Rinder!A2,\" \",Rinder!B2)","v":"Stallblatt 1"},null,"Anbindehaltg",{"$f":"Rinder!B4","v":0},null,null,null,"Max. Tierzahl","Max Tierzahl ges.","Gehaltene Tiere","Tiere max. / ha","Kg N max."]
["Kälber <1 Jahr <100kg",null,{"$f":"IF(Rinder!D7=0,0,Rinder!D7)","v":0},{"$f":"Rinder!F7","v":0},{"$f":"Rinder!J7","v":0},null,{"$f":"Rinder!O7","v":0},{"$f":"Rinder!R7","v":0},{"$f":"IF(C4=0,0,IF(SUM(D4:H4)=0,0,MIN(D4:H4)))","v":0},{"$f":"I4+I13+I22+I31","v":0},{"$f":"Rinder!K7+Rinder!K27+Rinder!K47+Rinder!K67","v":0},5,{"$f":"K4/L4*$L$2","v":0}]
["Kälber <1 Jahr <200kg",null,{"$f":"IF(Rinder!D8=0,0,Rinder!D8)","v":0},{"$f":"Rinder!F8","v":0},{"$f":"Rinder!J8","v":0},null,{"$f":"Rinder!O8","v":0},{"$f":"Rinder!R8","v":0},{"$f":"IF(C5=0,0,IF(SUM(D5:H5)=0,0,MIN(D5:H5)))","v":0},{"$f":"I5+I14+I23+I32","v":0},{"$f":"Rinder!K8+Rinder!K28+Rinder!K48+Rinder!K68","v":0},5,0]
["Rinder 1-2 Jahr <350kg",null,{"$f":"IF(Rinder!D9=0,0,Rinder!D9)","v":0},{"$f":"Rinder!F9","v":0},{"$f":"Rinder!J9","v":0},{"$f":"Rinder!G9","v":0},{"$f":"Rinder!O9","v":0},{"$f":"Rinder!R9","v":0},0,0,{"$f":"Rinder!K9+Rinder!K29+Rinder!K49+Rinder!K69","v":0},3.3,0]
["Milchkühe",null,{"$f":"IF(Rinder!D11=0,0,Rinder!D11)","v":0},{"$f":"IF(Rinder!$B$4=\"JA\",Rinder!G11,ROUNDDOWN(Rinder!$E11/Rinder!$C11,0))","v":0},{"$f":"Rinder!J11","v":0},{"$f":"Rinder!G11","v":0},{"$f":"Rinder!O11","v":0},{"$f":"Rinder!R11","v":0},0,0,{"$f":"Rinder!K11+Rinder!K31+Rinder!K51+Rinder!K71","v":0},2,0]
["Mutter Ammenkühe",null,{"$f":"IF(Rinder!D12=0,0,Rinder!D12)","v":0},{"$f":"IF(Rinder!$B$4=\"JA\",ROUNDDOWN(MIN(Rinder!$G12,Rinder!$O12,Rinder!$R12),0),ROUNDDOWN(Rinder!$E12/Rinder!$C12,0))","v":0},{"$f":"Rinder!J12","v":0},{"$f":"Rinder!G12","v":0},{"$f":"Rinder!O12","v":0},{"$f":"Rinder!R12","v":0},0,0,{"$f":"Rinder!K12+Rinder!K32+Rinder!K52+Rinder!K72","v":0},2,0]
["Bullen >2 Jahr >350kg",null,{"$f":"IF(Rinder!D14=0,0,Rinder!D14)","v":0},{"$f":"IF(Rinder!$B$4=\"JA\",ROUNDDOWN(MIN(Rinder!$G14,Rinder!$O14,Rinder!$R14),0),ROUNDDOWN(Rinder!$E14/Rinder!$C14,0))","v":0},{"$f":"Rinder!J14","v":0},{"$f":"Rinder!G14","v":0},{"$f":"Rinder!O14","v":0},{"$f":"Rinder!R14","v":0},0,0,{"$f":"Rinder!K14+Rinder!K34+Rinder!K54+Rinder!K74","v":0},2,0]
["Färsen >2 Jahr >350kg",null,{"$f":"IF(Rinder!D15=0,0,Rinder!D15)","v":0},{"$f":"IF(Rinder!$B$4=\"JA\",ROUNDDOWN(MIN(Rinder!$G15,Rinder!$O15,Rinder!$R15),0),ROUNDDOWN(Rinder!$E15/Rinder!$C15,0))","v":0},{"$f":"Rinder!J15","v":0},{"$f":"Rinder!G15","v":0},{"$f":"Rinder!O15","v":0},{"$f":"Rinder!R15","v":0},0,0,{"$f":"Rinder!K15+Rinder!K35+Rinder!K55+Rinder!K75","v":0},2.5,0]
["Zuchtbullen",null,{"$f":"IF(Rinder!E17=0,0,Rinder!E17)","v":0},{"$f":"IF(Rinder!$B$4=\"JA\",ROUNDDOWN(MIN(Rinder!$G17,Rinder!$O17,Rinder!$R17),0),ROUNDDOWN(Rinder!$E17/Rinder!$C17,0))","v":0},{"$f":"Rinder!J17","v":0},{"$f":"Rinder!G17","v":0},{"$f":"Rinder!O17","v":0},{"$f":"Rinder!R17","v":0},0,0,{"$f":"Rinder!K17+Rinder!K37+Rinder!K57+Rinder!K77","v":0},2,0]
["Rinder",{"$f":"CONCATENATE(Rinder!A22,\" \",Rinder!B22)","v":"Stallblatt 2"},null,"Anbindehaltg",{"$f":"Rinder!B24","v":0},null,null,null,"Max. Tierzahl",null,null,{"$f":"CONCATENATE(\"Gesamt \",A3)","v":"Gesamt Rinder"},{"$f":"SUM(M4:M11)","v":0}]
["Kälber <1 Jahr <100kg",null,{"$f":"IF(Rinder!D27=0,0,Rinder!D27)","v":0},{"$f":"Rinder!F27","v":0},{"$f":"Rinder!J27","v":0},null,{"$f":"Rinder!O27","v":0},{"$f":"Rinder!R27","v":0},{"$f":"IF(C13=0,0,IF(SUM(D13:H13)=0,0,MIN(D13:H13)))","v":0}]
["Kälber <1 Jahr <200kg",null,{"$f":"IF(Rinder!D28=0,0,Rinder!D28)","v":0},{"$f":"Rinder!F28","v":0},{"$f":"Rinder!J28","v":0},null,{"$f":"Rinder!O28","v":0},{"$f":"Rinder!R28","v":0},{"$f":"IF(C14=0,0,IF(SUM(D14:H14)=0,0,MIN(D14:H14)))","v":0}]
["Rinder 1-2 Jahr <350kg",null,{"$f":"IF(Rinder!D29=0,0,Rinder!D29)","v":0},{"$f":"Rinder!F29","v":0},{"$f":"Rinder!J29","v":0},null,{"$f":"Rinder!O29","v":0},{"$f":"Rinder!R29","v":0},0]
["Milchkühe",null,{"$f":"IF(Rinder!D31=0,0,Rinder!D31)","v":0},{"$f":"IF(Rinder!$B$24=\"JA\",ROUNDDOWN(MIN(Rinder!$G31,Rinder!$O31,Rinder!$R31),0),ROUNDDOWN(Rinder!$E31/Rinder!$C31,0))","v":0},{"$f":"Rinder!J31","v":0},{"$f":"IF(Rinder!B$4=\"JA\",Rinder!G31,ROUNDDOWN(MIN(Rinder!F31,Rinder!J31,Rinder!O31,Rinder!R31),0))","v":0},{"$f":"Rinder!O31","v":0},{"$f":"Rinder!R31","v":0},0]
["Mutter Ammenkühe",null,{"$f":"IF(Rinder!D32=0,0,Rinder!D32)","v":0},{"$f":"IF(Rinder!$B$24=\"JA\",ROUNDDOWN(MIN(Rinder!$G32,Rinder!$O32,Rinder!$R32),0),ROUNDDOWN(Rinder!$E32/Rinder!$C32,0))","v":0},{"$f":"Rinder!J32","v":0},{"$f":"IF(Rinder!B$4=\"JA\",Rinder!G32,ROUNDDOWN(MIN(Rinder!F32,Rinder!J32,Rinder!O32,Rinder!R32),0))","v":0},{"$f":"Rinder!O32","v":0},{"$f":"Rinder!R32","v":0},0]
["Bullen >2 Jahr >350kg",null,{"$f":"IF(Rinder!D34=0,0,Rinder!D34)","v":0},{"$f":"IF(Rinder!$B$24=\"JA\",ROUNDDOWN(MIN(Rinder!$G34,Rinder!$O34,Rinder!$R34),0),ROUNDDOWN(Rinder!$E34/Rinder!$C34,0))","v":0},{"$f":"Rinder!J34","v":0},{"$f":"IF(Rinder!B24=\"JA\",Rinder!G34,ROUNDDOWN(MIN(Rinder!F34,Rinder!J34,Rinder!O34,Rinder!R34),0))","v":0},{"$f":"Rinder!O34","v":0},{"$f":"Rinder!R34","v":0},0]
["Färsen >2 Jahr >350kg",null,{"$f":"IF(Rinder!D35=0,0,Rinder!D35)","v":0},{"$f":"IF(Rinder!$B$24=\"JA\",ROUNDDOWN(MIN(Rinder!$G35,Rinder!$O35,Rinder!$R35),0),ROUNDDOWN(Rinder!$E35/Rinder!$C35,0))","v":0},{"$f":"Rinder!J35","v":0},{"$f":"IF(Rinder!B24=\"JA\",Rinder!G35,ROUNDDOWN(MIN(Rinder!F35,Rinder!J35,Rinder!O35,Rinder!R35),0))","v":0},{"$f":"Rinder!O35","v":0},{"$f":"Rinder!R35","v":0},0]
["Zuchtbullen",null,{"$f":"IF(Rinder!D37=0,0,Rinder!D37)","v":0},{"$f":"IF(Rinder!$B$24=\"JA\",ROUNDDOWN(MIN(Rinder!$G37,Rinder!$O37,Rinder!$R37),0),ROUNDDOWN(Rinder!$E37/Rinder!$C37,0))","v":0},{"$f":"Rinder!J37","v":0},{"$f":"IF(Rinder!B24=\"JA\",Rinder!G37,ROUNDDOWN(MIN(Rinder!F37,Rinder!J37,Rinder!O37,Rinder!R37),0))","v":0},{"$f":"Rinder!O37","v":0},{"$f":"Rinder!R37","v":0},0]
["Rinder",{"$f":"CONCATENATE(Rinder!A42,\" \",Rinder!B42)","v":"Stallblatt 3"},null,"Anbindehaltg",{"$f":"Rinder!B44","v":0},null,null,null,"Max. Tierzahl"]
["Kälber <1 Jahr <100kg",null,{"$f":"IF(Rinder!D47=0,0,Rinder!D47)","v":0},{"$f":"Rinder!F47","v":0},{"$f":"Rinder!J47","v":0},null,{"$f":"Rinder!O47","v":0},{"$f":"Rinder!R47","v":0},{"$f":"IF(C22=0,0,IF(SUM(D22:H22)=0,0,MIN(D22:H22)))","v":0}]
["Kälber <1 Jahr <200kg",null,{"$f":"IF(Rinder!D48=0,0,Rinder!D48)","v":0},{"$f":"Rinder!F48","v":0},{"$f":"Rinder!J48","v":0},null,{"$f":"Rinder!O48","v":0},{"$f":"Rinder!R48","v":0},{"$f":"IF(C23=0,0,IF(SUM(D23:H23)=0,0,MIN(D23:H23)))","v":0}]
["Rinder 1-2 Jahr <350kg",null,{"$f":"IF(Rinder!D49=0,0,Rinder!D49)","v":0},{"$f":"Rinder!F49","v":0},{"$f":"Rinder!J49","v":0},null,{"$f":"Rinder!O49","v":0},{"$f":"Rinder!R49","v":0},0]
["Milchkühe",null,{"$f":"IF(Rinder!D51=0,0,Rinder!D51)","v":0},{"$f":"IF(Rinder!$B$44=\"JA\",ROUNDDOWN(MIN(Rinder!$G51,Rinder!$O51,Rinder!$R51),0),ROUNDDOWN(Rinder!$E51/Rinder!$C51,0))","v":0},{"$f":"Rinder!J51","v":0},{"$f":"IF(Rinder!B$4=\"JA\",Rinder!G51,ROUNDDOWN(MIN(Rinder!F51,Rinder!J51,Rinder!O51,Rinder!R51),0))","v":0},{"$f":"Rinder!O51","v":0},{"$f":"Rinder!R51","v":0},0]
["Mutter Ammenkühe",null,{"$f":"IF(Rinder!D52=0,0,Rinder!D52)","v":0},{"$f":"IF(Rinder!$B$44=\"JA\",ROUNDDOWN(MIN(Rinder!$G52,Rinder!$O52,Rinder!$R52),0),ROUNDDOWN(Rinder!$E52/Rinder!$C52,0))","v":0},{"$f":"Rinder!J52","v":0},{"$f":"IF(Rinder!B$4=\"JA\",Rinder!G52,ROUNDDOWN(MIN(Rinder!F52,Rinder!J52,Rinder!O52,Rinder!R52),0))","v":0},{"$f":"Rinder!O52","v":0},{"$f":"Rinder!R52","v":0},0]
["Bullen >2 Jahr >350kg",null,{"$f":"IF(Rinder!D54=0,0,Rinder!D54)","v":0},{"$f":"IF(Rinder!$B$44=\"JA\",ROUNDDOWN(MIN(Rinder!$G54,Rinder!$O54,Rinder!$R54),0),ROUNDDOWN(Rinder!$E54/Rinder!$C54,0))","v":0},{"$f":"Rinder!J54","v":0},{"$f":"IF(Rinder!B44=\"JA\",Rinder!G54,ROUNDDOWN(MIN(Rinder!F54,Rinder!J54,Rinder!O54,Rinder!R54),0))","v":0},{"$f":"Rinder!O54","v":0},{"$f":"Rinder!R54","v":0},0]
["Färsen >2 Jahr >350kg",null,{"$f":"IF(Rinder!D55=0,0,Rinder!D55)","v":0},{"$f":"IF(Rinder!$B$44=\"JA\",ROUNDDOWN(MIN(Rinder!$G55,Rinder!$O55,Rinder!$R55),0),ROUNDDOWN(Rinder!$E55/Rinder!$C55,0))","v":0},{"$f":"Rinder!J55","v":0},{"$f":"IF(Rinder!B44=\"JA\",Rinder!G55,ROUNDDOWN(MIN(Rinder!F55,Rinder!J55,Rinder!O55,Rinder!R55),0))","v":0},{"$f":"Rinder!O55","v":0},{"$f":"Rinder!R55","v":0},0]
["Zuchtbullen",null,{"$f":"IF(Rinder!D57=0,0,Rinder!D57)","v":0},{"$f":"IF(Rinder!$B$44=\"JA\",ROUNDDOWN(MIN(Rinder!$G57,Rinder!$O57,Rinder!$R57),0),ROUNDDOWN(Rinder!$E57/Rinder!$C57,0))","v":0},{"$f":"Rinder!J57","v":0},{"$f":"IF(Rinder!B44=\"JA\",Rinder!G57,ROUNDDOWN(MIN(Rinder!F57,Rinder!J57,Rinder!O57,Rinder!R57),0))","v":0},{"$f":"Rinder!O57","v":0},{"$f":"Rinder!R57","v":0},0]
["Rinder",{"$f":"CONCATENATE(Rinder!A62,\" \",Rinder!B62)","v":"Stallblatt 4"},null,"Anbindehaltg",{"$f":"Rinder!B64","v":0},null,null,null,"Max. Tierzahl"]
["Kälber <1 Jahr <100kg",null,{"$f":"IF(Rinder!D67=0,0,Rinder!D67)","v":0},{"$f":"Rinder!F67","v":0},{"$f":"Rinder!J67","v":0},null,{"$f":"Rinder!O67","v":0},{"$f":"Rinder!R67","v":0},{"$f":"IF(C31=0,0,IF(SUM(D31:H31)=0,0,MIN(D31:H31)))","v":0}]
["Kälber <1 Jahr <200kg",null,{"$f":"IF(Rinder!D68=0,0,Rinder!D68)","v":0},{"$f":"Rinder!F68","v":0},{"$f":"Rinder!J68","v":0},null,{"$f":"Rinder!O68","v":0},{"$f":"Rinder!R68","v":0},{"$f":"IF(C32=0,0,IF(SUM(D32:H32)=0,0,MIN(D32:H32)))","v":0}]
["Rinder 1-2 Jahr <350kg",null,{"$f":"IF(Rinder!D69=0,0,Rinder!D69)","v":0},{"$f":"Rinder!F69","v":0},{"$f":"Rinder!J69","v":0},null,{"$f":"Rinder!O69","v":0},{"$f":"Rinder!R69","v":0},0]
["Milchkühe",null,{"$f":"IF(Rinder!D71=0,0,Rinder!D71)","v":0},{"$f":"IF(Rinder!$B$64=\"JA\",ROUNDDOWN(MIN(Rinder!$G71,Rinder!$O71,Rinder!$R71),0),ROUNDDOWN(Rinder!$E71/Rinder!$C71,0))","v":0},{"$f":"Rinder!J71","v":0},{"$f":"IF(Rinder!B$4=\"JA\",Rinder!G71,ROUNDDOWN(MIN(Rinder!F71,Rinder!J71,Rinder!O71,Rinder!R71),0))","v":0},{"$f":"Rinder!O71","v":0},{"$f":"Rinder!R71","v":0},0]
["Mutter Ammenkühe",null,{"$f":"IF(Rinder!D72=0,0,Rinder!D72)","v":0},{"$f":"IF(Rinder!$B$64=\"JA\",ROUNDDOWN(MIN(Rinder!$G72,Rinder!$O72,Rinder!$R72),0),ROUNDDOWN(Rinder!$E72/Rinder!$C72,0))","v":0},{"$f":"Rinder!J72","v":0},{"$f":"IF(Rinder!B$4=\"JA\",Rinder!G72,ROUNDDOWN(MIN(Rinder!F72,Rinder!J72,Rinder!O72,Rinder!R72),0))","v":0},{"$f":"Rinder!O72","v":0},{"$f":"Rinder!R72","v":0},0]
["Bullen >2 Jahr >350kg",null,{"$f":"IF(Rinder!D74=0,0,Rinder!D74)","v":0},{"$f":"IF(Rinder!$B$64=\"JA\",ROUNDDOWN(MIN(Rinder!$G74,Rinder!$O74,Rinder!$R74),0),ROUNDDOWN(Rinder!$E74/Rinder!$C74,0))","v":0},{"$f":"Rinder!J74","v":0},{"$f":"IF(Rinder!B64=\"JA\",Rinder!G74,ROUNDDOWN(MIN(Rinder!F74,Rinder!J74,Rinder!O74,Rinder!R74),0))","v":0},{"$f":"Rinder!O74","v":0},{"$f":"Rinder!R74","v":0},0]
["Färsen >2 Jahr >350kg",null,{"$f":"IF(Rinder!D75=0,0,Rinder!D75)","v":0},{"$f":"IF(Rinder!$B$64=\"JA\",ROUNDDOWN(MIN(Rinder!$G75,Rinder!$O75,Rinder!$R75),0),ROUNDDOWN(Rinder!$E75/Rinder!$C75,0))","v":0},{"$f":"Rinder!J75","v":0},{"$f":"IF(Rinder!B64=\"JA\",Rinder!G75,ROUNDDOWN(MIN(Rinder!F75,Rinder!J75,Rinder!O75,Rinder!R75),0))","v":0},{"$f":"Rinder!O75","v":0},{"$f":"Rinder!R75","v":0},0]
["Zuchtbullen",null,{"$f":"IF(Rinder!D77=0,0,Rinder!D77)","v":0},{"$f":"IF(Rinder!$B$64=\"JA\",ROUNDDOWN(MIN(Rinder!$G77,Rinder!$O77,Rinder!$R77),0),ROUNDDOWN(Rinder!$E77/Rinder!$C77,0))","v":0},{"$f":"Rinder!J77","v":0},{"$f":"IF(Rinder!B64=\"JA\",Rinder!G77,ROUNDDOWN(MIN(Rinder!F77,Rinder!J77,Rinder!O77,Rinder!R77),0))","v":0},{"$f":"Rinder!O77","v":0},{"$f":"Rinder!R77","v":0},0]
[]
["Schafe",null,{"$f":"'Kl. Wiederkäuer_Equidien'!A2","v":"Stallblatt"},{"$f":"'Kl. Wiederkäuer_Equidien'!B2","v":1},null,null,null,null,"Max. Tierzahl","Max Tierzahl ges.","Gehaltene Tiere","Tiere max. / ha","Kg N max."]
["Lamm (< 1J)",null,{"$f":"IF('Kl. Wiederkäuer_Equidien'!D7=0,0,'Kl. Wiederkäuer_Equidien'!D7)","v":0},{"$f":"'Kl. Wiederkäuer_Equidien'!F7","v":0},{"$f":"'Kl. Wiederkäuer_Equidien'!I7","v":0},null,{"$f":"'Kl. Wiederkäuer_Equidien'!N7","v":0},{"$f":"'Kl. Wiederkäuer_Equidien'!Q7","v":0},{"$f":"IF(C41=0,0,IF(SUM(D41:H41)=0,0,MIN(D41:H41)))","v":0},{"$f":"I41+I52+I63+I74","v":0},{"$f":"'Kl. Wiederkäuer_Equidien'!J7+'Kl. Wiederkäuer_Equidien'!J26+'Kl. Wiederkäuer_Equidien'!J45+'Kl. Wiederkäuer_Equidien'!J64","v":0},26,{"$f":"K41/L41*$L$2","v":0}]
["Mutter/Milchschaf",null,{"$f":"IF('Kl. Wiederkäuer_Equidien'!D8=0,0,'Kl. Wiederkäuer_Equidien'!D8)","v":0},{"$f":"'Kl. Wiederkäuer_Equidien'!F8","v":0},{"$f":"'Kl. Wiederkäuer_Equidien'!I8","v":0},null,{"$f":"'Kl. Wiederkäuer_Equidien'!N8","v":0},{"$f":"'Kl. Wiederkäuer_Equidien'!Q8","v":0},{"$f":"IF(C42=0,0,IF(SUM(D42:H42)=0,0,MIN(D42:H42)))","v":0},{"$f":"I42+I53+I64+I75","v":0},{"$f":"'Kl. Wiederkäuer_Equidien'!J8+'Kl. Wiederkäuer_Equidien'!J27+'Kl. Wiederkäuer_Equidien'!J46+'Kl. Wiederkäuer_Equidien'!J65","v":0},13.3,{"$f":"K42/L42*$L$2","v":0}]
["Ziegen",null,null,null,null,null,null,null,null,null,null,{"$f":"CONCATENATE(\"Gesamt \",A40)","v":"Gesamt Schafe"},{"$f":"SUM(M41:M42)","v":0}]
["Ziegenlamm (< 1J)",null,{"$f":"IF('Kl. Wiederkäuer_Equidien'!D10=0,0,'Kl. Wiederkäuer_Equidien'!D10)","v":0},{"$f":"'Kl. Wiederkäuer_Equidien'!F10","v":0},{"$f":"'Kl. Wiederkäuer_Equidien'!I10","v":0},null,{"$f":"'Kl. Wiederkäuer_Equidien'!N10","v":0},{"$f":"'Kl. Wiederkäuer_Equidien'!Q10","v":0},{"$f":"IF(C44=0,0,IF(SUM(D44:H44)=0,0,MIN(D44:H44)))","v":0},{"$f":"I44+I55+I66+I77","v":0},{"$f":"'Kl. Wiederkäuer_Equidien'!J10+'Kl. Wiederkäuer_Equidien'!J29+'Kl. Wiederkäuer_Equidien'!J48+'Kl. Wiederkäuer_Equidien'!J67","v":0},26,{"$f":"K44/L44*$L$2","v":0}]
["Ziegen",null,{"$f":"IF('Kl. Wiederkäuer_Equidien'!D11=0,0,'Kl. Wiederkäuer_Equidien'!D11)","v":0},{"$f":"'Kl. Wiederkäuer_Equidien'!F11","v":0},{"$f":"'Kl. Wiederkäuer_Equidien'!I11","v":0},null,{"$f":"'Kl. Wiederkäuer_Equidien'!N11","v":0},{"$f":"'Kl. Wiederkäuer_Equidien'!Q11","v":0},{"$f":"IF(C45=0,0,IF(SUM(D45:H45)=0,0,MIN(D45:H45)))","v":0},{"$f":"I45+I56+I67+I78","v":0},{"$f":"'Kl. Wiederkäuer_Equidien'!J11+'Kl. Wiederkäuer_Equidien'!J30+'Kl. Wiederkäuer_Equidien'!J49+'Kl. Wiederkäuer_Equidien'!J68","v":0},13.3,{"$f":"K45/L45*$L$2","v":0}]
["Pferde",null,null,null,null,null,null,null,null,null,null,{"$f":"CONCATENATE(\"Gesamt \",A43)","v":"Gesamt Ziegen"},{"$f":"SUM(M44:M45)","v":0}]
["Pferde < 100 kg ",null,{"$f":"IF('Kl. Wiederkäuer_Equidien'!D13=0,0,'Kl. Wiederkäuer_Equidien'!D13)","v":0},{"$f":"'Kl. Wiederkäuer_Equidien'!F13","v":0},{"$f":"'Kl. Wiederkäuer_Equidien'!I13","v":0},null,{"$f":"'Kl. Wiederkäuer_Equidien'!N13","v":0},{"$f":"'Kl. Wiederkäuer_Equidien'!Q13","v":0},{"$f":"IF(C47=0,0,IF(SUM(D47:H47)=0,0,MIN(D47:H47)))","v":0},{"$f":"I47+I58+I69+I80","v":0},{"$f":"'Kl. Wiederkäuer_Equidien'!J13+'Kl. Wiederkäuer_Equidien'!J32+'Kl. Wiederkäuer_Equidien'!J51+'Kl. Wiederkäuer_Equidien'!J70","v":0},5,{"$f":"K47/L47*$L$2","v":0}]
["Pferde bis 200 kg ",null,{"$f":"IF('Kl. Wiederkäuer_Equidien'!D14=0,0,'Kl. Wiederkäuer_Equidien'!D14)","v":0},{"$f":"'Kl. Wiederkäuer_Equidien'!F14","v":0},{"$f":"'Kl. Wiederkäuer_Equidien'!I14","v":0},null,{"$f":"'Kl. Wiederkäuer_Equidien'!N14","v":0},{"$f":"'Kl. Wiederkäuer_Equidien'!Q14","v":0},{"$f":"IF(C48=0,0,IF(SUM(D48:H48)=0,0,MIN(D48:H48)))","v":0},{"$f":"I48+I59+I70+I81","v":0},{"$f":"'Kl. Wiederkäuer_Equidien'!J14+'Kl. Wiederkäuer_Equidien'!J33+'Kl. Wiederkäuer_Equidien'!J52+'Kl. Wiederkäuer_Equidien'!J71","v":0},5,{"$f":"K48/L48*$L$2","v":0}]
["Pferde bis 350 kg ",null,{"$f":"IF('Kl. Wiederkäuer_Equidien'!D15=0,0,'Kl. Wiederkäuer_Equidien'!D15)","v":0},{"$f":"'Kl. Wiederkäuer_Equidien'!F15","v":0},{"$f":"'Kl. Wiederkäuer_Equidien'!I15","v":0},null,{"$f":"'Kl. Wiederkäuer_Equidien'!N15","v":0},{"$f":"'Kl. Wiederkäuer_Equidien'!Q15","v":0},0,0,{"$f":"'Kl. Wiederkäuer_Equidien'!J15+'Kl. Wiederkäuer_Equidien'!J34+'Kl. Wiederkäuer_Equidien'!J53+'Kl. Wiederkäuer_Equidien'!J72","v":0},3.3,0]
["Pferde über 350 kg ",null,{"$f":"IF('Kl. Wiederkäuer_Equidien'!D16=0,0,'Kl. Wiederkäuer_Equidien'!D16)","v":0},{"$f":"'Kl. Wiederkäuer_Equidien'!F16","v":0},{"$f":"'Kl. Wiederkäuer_Equidien'!I16","v":0},null,{"$f":"'Kl. Wiederkäuer_Equidien'!N16","v":0},{"$f":"'Kl. Wiederkäuer_Equidien'!Q16","v":0},{"$f":"IF(C50=0,0,IF(SUM(D50:H50)=0,0,MIN(D50:H50)))","v":0},{"$f":"I50+I61+I72+I83","v":0},{"$f":"'Kl. Wiederkäuer_Equidien'!J16+'Kl. Wiederkäuer_Equidien'!J35+'Kl. Wiederkäuer_Equidien'!J54+'Kl. Wiederkäuer_Equidien'!J73","v":0},2,{"$f":"K50/L50*$L$2","v":0}]
["Schafe",null,{"$f":"'Kl. Wiederkäuer_Equidien'!A21","v":"Stallblatt"},{"$f":"'Kl. Wiederkäuer_Equidien'!B21","v":2},null,null,null,null,"Max. Tierzahl",null,null,{"$f":"CONCATENATE(\"Gesamt \",A46)","v":"Gesamt Pferde"},{"$f":"SUM(M47:M50)","v":0}]
["Lamm (< 1J)",null,{"$f":"IF('Kl. Wiederkäuer_Equidien'!D26=0,0,'Kl. Wiederkäuer_Equidien'!D26)","v":0},{"$f":"'Kl. Wiederkäuer_Equidien'!F26","v":0},{"$f":"'Kl. Wiederkäuer_Equidien'!I26","v":0},null,{"$f":"'Kl. Wiederkäuer_Equidien'!N26","v":0},{"$f":"'Kl. Wiederkäuer_Equidien'!Q26","v":0},{"$f":"IF(C52=0,0,IF(SUM(D52:H52)=0,0,MIN(D52:H52)))","v":0}]
["Mutter/Milchschaf",null,{"$f":"IF('Kl. Wiederkäuer_Equidien'!D27=0,0,'Kl. Wiederkäuer_Equidien'!D27)","v":0},{"$f":"'Kl. Wiederkäuer_Equidien'!F27","v":0},{"$f":"'Kl. Wiederkäuer_Equidien'!I27","v":0},null,{"$f":"'Kl. Wiederkäuer_Equidien'!N27","v":0},{"$f":"'Kl. Wiederkäuer_Equidien'!Q27","v":0},{"$f":"IF(C53=0,0,IF(SUM(D53:H53)=0,0,MIN(D53:H53)))","v":0}]
["Ziegen"]
["Ziegenlamm (< 1J)",null,{"$f":"IF('Kl. Wiederkäuer_Equidien'!D29=0,0,'Kl. Wiederkäuer_Equidien'!D29)","v":0},{"$f":"'Kl. Wiederkäuer_Equidien'!F29","v":0},{"$f":"'Kl. Wiederkäuer_Equidien'!I29","v":0},null,{"$f":"'Kl. Wiederkäuer_Equidien'!N29","v":0},{"$f":"'Kl. Wiederkäuer_Equidien'!Q29","v":0},{"$f":"IF(C55=0,0,IF(SUM(D55:H55)=0,0,MIN(D55:H55)))","v":0}]
["Ziegen",null,{"$f":"IF('Kl. Wiederkäuer_Equidien'!D30=0,0,'Kl. Wiederkäuer_Equidien'!D30)","v":0},{"$f":"'Kl. Wiederkäuer_Equidien'!F30","v":0},{"$f":"'Kl. Wiederkäuer_Equidien'!I30","v":0},null,{"$f":"'Kl. Wiederkäuer_Equidien'!N30","v":0},{"$f":"'Kl. Wiederkäuer_Equidien'!Q30","v":0},{"$f":"IF(C56=0,0,IF(SUM(D56:H56)=0,0,MIN(D56:H56)))","v":0}]
["Pferde"]
["Pferde < 100 kg ",null,{"$f":"IF('Kl. Wiederkäuer_Equidien'!D32=0,0,'Kl. Wiederkäuer_Equidien'!D32)","v":0},{"$f":"'Kl. Wiederkäuer_Equidien'!F32","v":0},{"$f":"'Kl. Wiederkäuer_Equidien'!I32","v":0},null,{"$f":"'Kl. Wiederkäuer_Equidien'!N32","v":0},{"$f":"'Kl. Wiederkäuer_Equidien'!Q32","v":0},{"$f":"IF(C58=0,0,IF(SUM(D58:H58)=0,0,MIN(D58:H58)))","v":0}]
["Pferde bis 200 kg ",null,{"$f":"IF('Kl. Wiederkäuer_Equidien'!D33=0,0,'Kl. Wiederkäuer_Equidien'!D33)","v":0},{"$f":"'Kl. Wiederkäuer_Equidien'!F33","v":0},{"$f":"'Kl. Wiederkäuer_Equidien'!I33","v":0},null,{"$f":"'Kl. Wiederkäuer_Equidien'!N33","v":0},{"$f":"'Kl. Wiederkäuer_Equidien'!Q33","v":0},{"$f":"IF(C59=0,0,IF(SUM(D59:H59)=0,0,MIN(D59:H59)))","v":0}]
["Pferde bis 350 kg ",null,{"$f":"IF('Kl. Wiederkäuer_Equidien'!D34=0,0,'Kl. Wiederkäuer_Equidien'!D34)","v":0},{"$f":"'Kl. Wiederkäuer_Equidien'!F34","v":0},{"$f":"'Kl. Wiederkäuer_Equidien'!I34","v":0},null,{"$f":"'Kl. Wiederkäuer_Equidien'!N34","v":0},{"$f":"'Kl. Wiederkäuer_Equidien'!Q34","v":0},0]
["Pferde über 350 kg ",null,{"$f":"IF('Kl. Wiederkäuer_Equidien'!D35=0,0,'Kl. Wiederkäuer_Equidien'!D35)","v":0},{"$f":"'Kl. Wiederkäuer_Equidien'!F35","v":0},{"$f":"'Kl. Wiederkäuer_Equidien'!I35","v":0},null,{"$f":"'Kl. Wiederkäuer_Equidien'!N35","v":0},{"$f":"'Kl. Wiederkäuer_Equidien'!Q35","v":0},{"$f":"IF(C61=0,0,IF(SUM(D61:H61)=0,0,MIN(D61:H61)))","v":0}]
["Schafe",null,{"$f":"'Kl. Wiederkäuer_Equidien'!A40","v":"Stallblatt"},{"$f":"'Kl. Wiederkäuer_Equidien'!B40","v":3},null,null,null,null,"Max. Tierzahl"]
["Lamm (< 1J)",null,{"$f":"IF('Kl. Wiederkäuer_Equidien'!D45=0,0,'Kl. Wiederkäuer_Equidien'!D45)","v":0},{"$f":"'Kl. Wiederkäuer_Equidien'!F45","v":0},{"$f":"'Kl. Wiederkäuer_Equidien'!I45","v":0},null,{"$f":"'Kl. Wiederkäuer_Equidien'!N45","v":0},{"$f":"'Kl. Wiederkäuer_Equidien'!Q45","v":0},{"$f":"IF(C63=0,0,IF(SUM(D63:H63)=0,0,MIN(D63:H63)))","v":0}]
["Mutter/Milchschaf",null,{"$f":"IF('Kl. Wiederkäuer_Equidien'!D46=0,0,'Kl. Wiederkäuer_Equidien'!D46)","v":0},{"$f":"'Kl. Wiederkäuer_Equidien'!F46","v":0},{"$f":"'Kl. Wiederkäuer_Equidien'!I46","v":0},null,{"$f":"'Kl. Wiederkäuer_Equidien'!N46","v":0},{"$f":"'Kl. Wiederkäuer_Equidien'!Q46","v":0},{"$f":"IF(C64=0,0,IF(SUM(D64:H64)=0,0,MIN(D64:H64)))","v":0}]
["Ziegen"]
["Ziegenlamm (< 1J)",null,{"$f":"IF('Kl. Wiederkäuer_Equidien'!D48=0,0,'Kl. Wiederkäuer_Equidien'!D48)","v":0},{"$f":"'Kl. Wiederkäuer_Equidien'!F48","v":0},{"$f":"'Kl. Wiederkäuer_Equidien'!I48","v":0},null,{"$f":"'Kl. Wiederkäuer_Equidien'!N48","v":0},{"$f":"'Kl. Wiederkäuer_Equidien'!Q48","v":0},{"$f":"IF(C66=0,0,IF(SUM(D66:H66)=0,0,MIN(D66:H66)))","v":0}]
["Ziegen",null,{"$f":"IF('Kl. Wiederkäuer_Equidien'!D49=0,0,'Kl. Wiederkäuer_Equidien'!D49)","v":0},{"$f":"'Kl. Wiederkäuer_Equidien'!F49","v":0},{"$f":"'Kl. Wiederkäuer_Equidien'!I49","v":0},null,{"$f":"'Kl. Wiederkäuer_Equidien'!N49","v":0},{"$f":"'Kl. Wiederkäuer_Equidien'!Q49","v":0},{"$f":"IF(C67=0,0,IF(SUM(D67:H67)=0,0,MIN(D67:H67)))","v":0}]
["Pferde"]
["Pferde < 100 kg ",null,{"$f":"IF('Kl. Wiederkäuer_Equidien'!D51=0,0,'Kl. Wiederkäuer_Equidien'!D51)","v":0},{"$f":"'Kl. Wiederkäuer_Equidien'!F51","v":0},{"$f":"'Kl. Wiederkäuer_Equidien'!I51","v":0},null,{"$f":"'Kl. Wiederkäuer_Equidien'!N51","v":0},{"$f":"'Kl. Wiederkäuer_Equidien'!Q51","v":0},{"$f":"IF(C69=0,0,IF(SUM(D69:H69)=0,0,MIN(D69:H69)))","v":0}]
["Pferde bis 200 kg ",null,{"$f":"IF('Kl. Wiederkäuer_Equidien'!D52=0,0,'Kl. Wiederkäuer_Equidien'!D52)","v":0},{"$f":"'Kl. Wiederkäuer_Equidien'!F52","v":0},{"$f":"'Kl. Wiederkäuer_Equidien'!I52","v":0},null,{"$f":"'Kl. Wiederkäuer_Equidien'!N52","v":0},{"$f":"'Kl. Wiederkäuer_Equidien'!Q52","v":0},{"$f":"IF(C70=0,0,IF(SUM(D70:H70)=0,0,MIN(D70:H70)))","v":0}]
["Pferde bis 350 kg ",null,{"$f":"IF('Kl. Wiederkäuer_Equidien'!D53=0,0,'Kl. Wiederkäuer_Equidien'!D53)","v":0},{"$f":"'Kl. Wiederkäuer_Equidien'!F53","v":0},{"$f":"'Kl. Wiederkäuer_Equidien'!I53","v":0},null,{"$f":"'Kl. Wiederkäuer_Equidien'!N53","v":0},{"$f":"'Kl. Wiederkäuer_Equidien'!Q53","v":0},0]
["Pferde über 350 kg ",null,{"$f":"IF('Kl. Wiederkäuer_Equidien'!D54=0,0,'Kl. Wiederkäuer_Equidien'!D54)","v":0},{"$f":"'Kl. Wiederkäuer_Equidien'!F54","v":0},{"$f":"'Kl. Wiederkäuer_Equidien'!I54","v":0},null,{"$f":"'Kl. Wiederkäuer_Equidien'!N54","v":0},{"$f":"'Kl. Wiederkäuer_Equidien'!Q54","v":0},{"$f":"IF(C72=0,0,IF(SUM(D72:H72)=0,0,MIN(D72:H72)))","v":0}]
["Schafe",null,{"$f":"'Kl. Wiederkäuer_Equidien'!A59","v":"Stallblatt"},{"$f":"'Kl. Wiederkäuer_Equidien'!B59","v":4},null,null,null,null,"Max. Tierzahl"]
["Lamm (< 1J)",null,{"$f":"IF('Kl. Wiederkäuer_Equidien'!D64=0,0,'Kl. Wiederkäuer_Equidien'!D64)","v":0},{"$f":"'Kl. Wiederkäuer_Equidien'!F64","v":0},{"$f":"'Kl. Wiederkäuer_Equidien'!I64","v":0},null,{"$f":"'Kl. Wiederkäuer_Equidien'!N64","v":0},{"$f":"'Kl. Wiederkäuer_Equidien'!Q64","v":0},{"$f":"IF(C74=0,0,IF(SUM(D74:H74)=0,0,MIN(D74:H74)))","v":0}]
["Mutter/Milchschaf",null,{"$f":"IF('Kl. Wiederkäuer_Equidien'!D65=0,0,'Kl. Wiederkäuer_Equidien'!D65)","v":0},{"$f":"'Kl. Wiederkäuer_Equidien'!F65","v":0},{"$f":"'Kl. Wiederkäuer_Equidien'!I65","v":0},null,{"$f":"'Kl. Wiederkäuer_Equidien'!N65","v":0},{"$f":"'Kl. Wiederkäuer_Equidien'!Q65","v":0},{"$f":"IF(C75=0,0,IF(SUM(D75:H75)=0,0,MIN(D75:H75)))","v":0}]
["Ziegen"]
["Ziegenlamm (< 1J)",null,{"$f":"IF('Kl. Wiederkäuer_Equidien'!D67=0,0,'Kl. Wiederkäuer_Equidien'!D67)","v":0},{"$f":"'Kl. Wiederkäuer_Equidien'!F67","v":0},{"$f":"'Kl. Wiederkäuer_Equidien'!I67","v":0},null,{"$f":"'Kl. Wiederkäuer_Equidien'!N67","v":0},{"$f":"'Kl. Wiederkäuer_Equidien'!Q67","v":0},{"$f":"IF(C77=0,0,IF(SUM(D77:H77)=0,0,MIN(D77:H77)))","v":0}]
["Ziegen",null,{"$f":"IF('Kl. Wiederkäuer_Equidien'!D68=0,0,'Kl. Wiederkäuer_Equidien'!D68)","v":0},{"$f":"'Kl. Wiederkäuer_Equidien'!F68","v":0},{"$f":"'Kl. Wiederkäuer_Equidien'!I68","v":0},null,{"$f":"'Kl. Wiederkäuer_Equidien'!N68","v":0},{"$f":"'Kl. Wiederkäuer_Equidien'!Q68","v":0},{"$f":"IF(C78=0,0,IF(SUM(D78:H78)=0,0,MIN(D78:H78)))","v":0}]
["Pferde"]
["Pferde < 100 kg ",null,{"$f":"IF('Kl. Wiederkäuer_Equidien'!D70=0,0,'Kl. Wiederkäuer_Equidien'!D70)","v":0},{"$f":"'Kl. Wiederkäuer_Equidien'!F70","v":0},{"$f":"'Kl. Wiederkäuer_Equidien'!I70","v":0},null,{"$f":"'Kl. Wiederkäuer_Equidien'!N70","v":0},{"$f":"'Kl. Wiederkäuer_Equidien'!Q70","v":0},{"$f":"IF(C80=0,0,IF(SUM(D80:H80)=0,0,MIN(D80:H80)))","v":0}]
["Pferde bis 200 kg ",null,{"$f":"IF('Kl. Wiederkäuer_Equidien'!D71=0,0,'Kl. Wiederkäuer_Equidien'!D71)","v":0},{"$f":"'Kl. Wiederkäuer_Equidien'!F71","v":0},{"$f":"'Kl. Wiederkäuer_Equidien'!I71","v":0},null,{"$f":"'Kl. Wiederkäuer_Equidien'!N71","v":0},{"$f":"'Kl. Wiederkäuer_Equidien'!Q71","v":0},{"$f":"IF(C81=0,0,IF(SUM(D81:H81)=0,0,MIN(D81:H81)))","v":0}]
["Pferde bis 350 kg ",null,{"$f":"IF('Kl. Wiederkäuer_Equidien'!D72=0,0,'Kl. Wiederkäuer_Equidien'!D72)","v":0},{"$f":"'Kl. Wiederkäuer_Equidien'!F72","v":0},{"$f":"'Kl. Wiederkäuer_Equidien'!I72","v":0},null,{"$f":"'Kl. Wiederkäuer_Equidien'!N72","v":0},{"$f":"'Kl. Wiederkäuer_Equidien'!Q72","v":0},0]
["Pferde über 350 kg ",null,{"$f":"IF('Kl. Wiederkäuer_Equidien'!D73=0,0,'Kl. Wiederkäuer_Equidien'!D73)","v":0},{"$f":"'Kl. Wiederkäuer_Equidien'!F73","v":0},{"$f":"'Kl. Wiederkäuer_Equidien'!I73","v":0},null,{"$f":"'Kl. Wiederkäuer_Equidien'!N73","v":0},{"$f":"'Kl. Wiederkäuer_Equidien'!Q73","v":0},{"$f":"IF(C83=0,0,IF(SUM(D83:H83)=0,0,MIN(D83:H83)))","v":0}]
[]
[null,null,"Box-nummer(n) lt. Stall-plan","max. Tierzahl \nStallflächen/-Plätze","max. Tierzahl \nStallboden",null,"max. Tierzahl \nAußen-flächen","max. Tierzahl \nÜberdachung"]
["Kaninchen",null,"Stallblatt",1,null,null,null,null,null,"Max Tierzahl ges.","Gehaltene Tiere","Tiere max. / ha","Kg N max."]
["Säugende Muttertiere mit Jungen bis zum Absetzen Mutter < 6kg",null,{"$f":"Kaninchen!D6","v":0},{"$f":"Kaninchen!F6","v":0},{"$f":"Kaninchen!I6","v":0},null,{"$f":"Kaninchen!M6","v":0},{"$f":"Kaninchen!P6","v":0},{"$f":"IF(C87=0,0,IF(SUM(D87:H87)=0,0,MIN(D87:H87)))","v":0},{"$f":"I87+I95+I103+I111+I119+I127","v":0},{"$f":"Kaninchen!J6+Kaninchen!J22+Kaninchen!J38+Kaninchen!J54+Kaninchen!J70+Kaninchen!J86","v":0},{"$f":"ROUNDDOWN(2/0.013,2)","v":153.84},{"$f":"K87/L87*$L$2","v":0}]
["Säugende Muttertiere mit Jungen bis zum Absetzen Mutter > 6kg",null,{"$f":"Kaninchen!D7","v":0},{"$f":"Kaninchen!F7","v":0},{"$f":"Kaninchen!I7","v":0},null,{"$f":"Kaninchen!M7","v":0},{"$f":"Kaninchen!P7","v":0},{"$f":"IF(C88=0,0,IF(SUM(D88:H88)=0,0,MIN(D88:H88)))","v":0},{"$f":"I88+I96+I104+I112+I120+I128","v":0},{"$f":"Kaninchen!J7+Kaninchen!J23+Kaninchen!J39+Kaninchen!J55+Kaninchen!J71+Kaninchen!J87","v":0},{"$f":"ROUNDDOWN(2/0.013,2)","v":153.84},0]
["Trächtige Tiere und weibliche Zuchtkaninchen < 6 kg",null,{"$f":"Kaninchen!D8","v":0},{"$f":"Kaninchen!F8","v":0},{"$f":"Kaninchen!I8","v":0},null,{"$f":"Kaninchen!M8","v":0},{"$f":"Kaninchen!P8","v":0},0,0,{"$f":"Kaninchen!J8+Kaninchen!J24+Kaninchen!J40+Kaninchen!J56+Kaninchen!J72+Kaninchen!J88","v":0},{"$f":"ROUNDDOWN(2/0.013,2)","v":153.84},0]
["Trächtige Tiere und weibliche Zuchtkaninchen > 6 kg",null,{"$f":"Kaninchen!D9","v":0},{"$f":"Kaninchen!F9","v":0},{"$f":"Kaninchen!I9","v":0},null,{"$f":"Kaninchen!M9","v":0},{"$f":"Kaninchen!P9","v":0},0,0,{"$f":"Kaninchen!J9+Kaninchen!J25+Kaninchen!J41+Kaninchen!J57+Kaninchen!J73+Kaninchen!J89","v":0},{"$f":"ROUNDDOWN(2/0.013,2)","v":153.84},0]
["Mastkaninchen vom Absetzen bis zur Schlachtung Nachzuchtkaninchen (vom Ende der Mast bis 6 Monate)",null,{"$f":"Kaninchen!D10","v":0},{"$f":"Kaninchen!F10","v":0},{"$f":"Kaninchen!I10","v":0},null,{"$f":"Kaninchen!M10","v":0},{"$f":"Kaninchen!P10","v":0},0,0,{"$f":"Kaninchen!J10+Kaninchen!J26+Kaninchen!J42+Kaninchen!J58+Kaninchen!J74+Kaninchen!J90","v":0},{"$f":"ROUNDDOWN(2/0.002,2)","v":1000},0]
["Erwachsene Rammler",null,{"$f":"Kaninchen!D11","v":0},{"$f":"Kaninchen!F11","v":0},{"$f":"Kaninchen!I11","v":0},null,{"$f":"Kaninchen!M11","v":0},{"$f":"Kaninchen!P11","v":0},0,0,{"$f":"Kaninchen!J11+Kaninchen!J27+Kaninchen!J43+Kaninchen!J59+Kaninchen!J75+Kaninchen!J91","v":0},{"$f":"ROUNDDOWN(2/0.013,2)","v":153.84},0]
["Erwachsene Rammler mit Weibchen zur Paarung",null,{"$f":"Kaninchen!D12","v":0},{"$f":"Kaninchen!F12","v":0},{"$f":"Kaninchen!I12","v":0},null,{"$f":"Kaninchen!M12","v":0},{"$f":"Kaninchen!P12","v":0},0,0,{"$f":"Kaninchen!J12+Kaninchen!J28+Kaninchen!J44+Kaninchen!J60+Kaninchen!J76+Kaninchen!J92","v":0},{"$f":"ROUNDDOWN(2/0.013,2)","v":153.84},0]
["Kaninchen",null,"Stallblatt",{"$f":"D86+1","v":2},null,null,null,null,null,null,null,"Gesamt Kaninchen",{"$f":"SUM(M87:M93)","v":0}]
["Säugende Muttertiere mit Jungen bis zum Absetzen Mutter < 6kg",null,{"$f":"Kaninchen!D22","v":0},{"$f":"Kaninchen!F22","v":0},{"$f":"Kaninchen!I22","v":0},null,{"$f":"Kaninchen!M22","v":0},{"$f":"Kaninchen!P22","v":0},{"$f":"IF(C95=0,0,IF(SUM(D95:H95)=0,0,MIN(D95:H95)))","v":0},"Quelle: LfL Basisdaten Tabelle 4b (Mrz. 21)"]
["Säugende Muttertiere mit Jungen bis zum Absetzen Mutter > 6kg",null,{"$f":"Kaninchen!D23","v":0},{"$f":"Kaninchen!F23","v":0},{"$f":"Kaninchen!I23","v":0},null,{"$f":"Kaninchen!M23","v":0},{"$f":"Kaninchen!P23","v":0},{"$f":"IF(C96=0,0,IF(SUM(D96:H96)=0,0,MIN(D96:H96)))","v":0}]
["Trächtige Tiere und weibliche Zuchtkaninchen < 6 kg",null,{"$f":"Kaninchen!D24","v":0},{"$f":"Kaninchen!F24","v":0},{"$f":"Kaninchen!I24","v":0},null,{"$f":"Kaninchen!M24","v":0},{"$f":"Kaninchen!P24","v":0},0]
["Trächtige Tiere und weibliche Zuchtkaninchen > 6 kg",null,{"$f":"Kaninchen!D25","v":0},{"$f":"Kaninchen!F25","v":0},{"$f":"Kaninchen!I25","v":0},null,{"$f":"Kaninchen!M25","v":0},{"$f":"Kaninchen!P25","v":0},0]
["Mastkaninchen vom Absetzen bis zur Schlachtung Nachzuchtkaninchen (vom Ende der Mast bis 6 Monate)",null,{"$f":"Kaninchen!D26","v":0},{"$f":"Kaninchen!F26","v":0},{"$f":"Kaninchen!I26","v":0},null,{"$f":"Kaninchen!M26","v":0},{"$f":"Kaninchen!P26","v":0},0]
["Erwachsene Rammler",null,{"$f":"Kaninchen!D27","v":0},{"$f":"Kaninchen!F27","v":0},{"$f":"Kaninchen!I27","v":0},null,{"$f":"Kaninchen!M27","v":0},{"$f":"Kaninchen!P27","v":0},0]
["Erwachsene Rammler mit Weibchen zur Paarung",null,{"$f":"Kaninchen!D28","v":0},{"$f":"Kaninchen!F28","v":0},{"$f":"Kaninchen!I28","v":0},null,{"$f":"Kaninchen!M28","v":0},{"$f":"Kaninchen!P28","v":0},0]
["Kaninchen",null,"Stallblatt",{"$f":"D94+1","v":3}]
["Säugende Muttertiere mit Jungen bis zum Absetzen Mutter < 6kg",null,{"$f":"Kaninchen!D38","v":0},{"$f":"Kaninchen!F38","v":0},{"$f":"Kaninchen!I38","v":0},null,{"$f":"Kaninchen!M38","v":0},{"$f":"Kaninchen!P38","v":0},{"$f":"IF(C103=0,0,IF(SUM(D103:H103)=0,0,MIN(D103:H103)))","v":0}]
["Säugende Muttertiere mit Jungen bis zum Absetzen Mutter > 6kg",null,{"$f":"Kaninchen!D39","v":0},{"$f":"Kaninchen!F39","v":0},{"$f":"Kaninchen!I39","v":0},null,{"$f":"Kaninchen!M39","v":0},{"$f":"Kaninchen!P39","v":0},{"$f":"IF(C104=0,0,IF(SUM(D104:H104)=0,0,MIN(D104:H104)))","v":0}]
["Trächtige Tiere und weibliche Zuchtkaninchen < 6 kg",null,{"$f":"Kaninchen!D40","v":0},{"$f":"Kaninchen!F40","v":0},{"$f":"Kaninchen!I40","v":0},null,{"$f":"Kaninchen!M40","v":0},{"$f":"Kaninchen!P40","v":0},0]
["Trächtige Tiere und weibliche Zuchtkaninchen > 6 kg",null,{"$f":"Kaninchen!D41","v":0},{"$f":"Kaninchen!F41","v":0},{"$f":"Kaninchen!I41","v":0},null,{"$f":"Kaninchen!M41","v":0},{"$f":"Kaninchen!P41","v":0},0]
["Mastkaninchen vom Absetzen bis zur Schlachtung Nachzuchtkaninchen (vom Ende der Mast bis 6 Monate)",null,{"$f":"Kaninchen!D42","v":0},{"$f":"Kaninchen!F42","v":0},{"$f":"Kaninchen!I42","v":0},null,{"$f":"Kaninchen!M42","v":0},{"$f":"Kaninchen!P42","v":0},0]
["Erwachsene Rammler",null,{"$f":"Kaninchen!D43","v":0},{"$f":"Kaninchen!F43","v":0},{"$f":"Kaninchen!I43","v":0},null,{"$f":"Kaninchen!M43","v":0},{"$f":"Kaninchen!P43","v":0},0]
["Erwachsene Rammler mit Weibchen zur Paarung",null,{"$f":"Kaninchen!D44","v":0},{"$f":"Kaninchen!F44","v":0},{"$f":"Kaninchen!I44","v":0},null,{"$f":"Kaninchen!M44","v":0},{"$f":"Kaninchen!P44","v":0},0]
["Kaninchen",null,"Stallblatt",{"$f":"D102+1","v":4}]
["Säugende Muttertiere mit Jungen bis zum Absetzen Mutter < 6kg",null,{"$f":"Kaninchen!D54","v":0},{"$f":"Kaninchen!F54","v":0},{"$f":"Kaninchen!I54","v":0},null,{"$f":"Kaninchen!M54","v":0},{"$f":"Kaninchen!P54","v":0},{"$f":"IF(C111=0,0,IF(SUM(D111:H111)=0,0,MIN(D111:H111)))","v":0}]
["Säugende Muttertiere mit Jungen bis zum Absetzen Mutter > 6kg",null,{"$f":"Kaninchen!D55","v":0},{"$f":"Kaninchen!F55","v":0},{"$f":"Kaninchen!I49","v":0},null,{"$f":"Kaninchen!M55","v":0},{"$f":"Kaninchen!P55","v":0},{"$f":"IF(C112=0,0,IF(SUM(D112:H112)=0,0,MIN(D112:H112)))","v":0}]
["Trächtige Tiere und weibliche Zuchtkaninchen < 6 kg",null,{"$f":"Kaninchen!D56","v":0},{"$f":"Kaninchen!F56","v":0},{"$f":"Kaninchen!I50","v":0},null,{"$f":"Kaninchen!M56","v":0},{"$f":"Kaninchen!P56","v":0},0]
["Trächtige Tiere und weibliche Zuchtkaninchen > 6 kg",null,{"$f":"Kaninchen!D57","v":0},{"$f":"Kaninchen!F57","v":0},{"$f":"Kaninchen!I51","v":0},null,{"$f":"Kaninchen!M57","v":0},{"$f":"Kaninchen!P57","v":0},0]
["Mastkaninchen vom Absetzen bis zur Schlachtung Nachzuchtkaninchen (vom Ende der Mast bis 6 Monate)",null,{"$f":"Kaninchen!D58","v":0},{"$f":"Kaninchen!F58","v":0},{"$f":"Kaninchen!I52","v":0},null,{"$f":"Kaninchen!M58","v":0},{"$f":"Kaninchen!P58","v":0},0]
["Erwachsene Rammler",null,{"$f":"Kaninchen!D59","v":0},{"$f":"Kaninchen!F59","v":0},{"$f":"Kaninchen!I53","v":"max. Tierzahl \nStallboden"},null,{"$f":"Kaninchen!M59","v":0},{"$f":"Kaninchen!P59","v":0},0]
["Erwachsene Rammler mit Weibchen zur Paarung",null,{"$f":"Kaninchen!D60","v":0},{"$f":"Kaninchen!F60","v":0},{"$f":"Kaninchen!I54","v":0},null,{"$f":"Kaninchen!M60","v":0},{"$f":"Kaninchen!P60","v":0},0]
["Kaninchen",null,"Stallblatt",{"$f":"D110+1","v":5}]
["Säugende Muttertiere mit Jungen bis zum Absetzen Mutter < 6kg",null,{"$f":"Kaninchen!D70","v":0},{"$f":"Kaninchen!F70","v":0},{"$f":"Kaninchen!I70","v":0},null,{"$f":"Kaninchen!M70","v":0},{"$f":"Kaninchen!P70","v":0},{"$f":"IF(C119=0,0,IF(SUM(D119:H119)=0,0,MIN(D119:H119)))","v":0}]
["Säugende Muttertiere mit Jungen bis zum Absetzen Mutter > 6kg",null,{"$f":"Kaninchen!D71","v":0},{"$f":"Kaninchen!F71","v":0},{"$f":"Kaninchen!I71","v":0},null,{"$f":"Kaninchen!M71","v":0},{"$f":"Kaninchen!P71","v":0},{"$f":"IF(C120=0,0,IF(SUM(D120:H120)=0,0,MIN(D120:H120)))","v":0}]
["Trächtige Tiere und weibliche Zuchtkaninchen < 6 kg",null,{"$f":"Kaninchen!D72","v":0},{"$f":"Kaninchen!F72","v":0},{"$f":"Kaninchen!I72","v":0},null,{"$f":"Kaninchen!M72","v":0},{"$f":"Kaninchen!P72","v":0},0]
["Trächtige Tiere und weibliche Zuchtkaninchen > 6 kg",null,{"$f":"Kaninchen!D73","v":0},{"$f":"Kaninchen!F73","v":0},{"$f":"Kaninchen!I73","v":0},null,{"$f":"Kaninchen!M73","v":0},{"$f":"Kaninchen!P73","v":0},0]
["Mastkaninchen vom Absetzen bis zur Schlachtung Nachzuchtkaninchen (vom Ende der Mast bis 6 Monate)",null,{"$f":"Kaninchen!D74","v":0},{"$f":"Kaninchen!F74","v":0},{"$f":"Kaninchen!I74","v":0},null,{"$f":"Kaninchen!M74","v":0},{"$f":"Kaninchen!P74","v":0},0]
["Erwachsene Rammler",null,{"$f":"Kaninchen!D75","v":0},{"$f":"Kaninchen!F75","v":0},{"$f":"Kaninchen!I75","v":0},null,{"$f":"Kaninchen!M75","v":0},{"$f":"Kaninchen!P75","v":0},0]
["Erwachsene Rammler mit Weibchen zur Paarung",null,{"$f":"Kaninchen!D76","v":0},{"$f":"Kaninchen!F76","v":0},{"$f":"Kaninchen!I76","v":0},null,{"$f":"Kaninchen!M76","v":0},{"$f":"Kaninchen!P76","v":0},0]
["Kaninchen",null,"Stallblatt",{"$f":"D118+1","v":6}]
["Säugende Muttertiere mit Jungen bis zum Absetzen Mutter < 6kg",null,{"$f":"Kaninchen!D86","v":0},{"$f":"Kaninchen!F86","v":0},{"$f":"Kaninchen!I86","v":0},null,{"$f":"Kaninchen!M86","v":0},{"$f":"Kaninchen!P86","v":0},{"$f":"IF(C127=0,0,IF(SUM(D127:H127)=0,0,MIN(D127:H127)))","v":0}]
["Säugende Muttertiere mit Jungen bis zum Absetzen Mutter > 6kg",null,{"$f":"Kaninchen!D87","v":0},{"$f":"Kaninchen!F87","v":0},{"$f":"Kaninchen!I87","v":0},null,{"$f":"Kaninchen!M87","v":0},{"$f":"Kaninchen!P87","v":0},{"$f":"IF(C128=0,0,IF(SUM(D128:H128)=0,0,MIN(D128:H128)))","v":0}]
["Trächtige Tiere und weibliche Zuchtkaninchen < 6 kg",null,{"$f":"Kaninchen!D88","v":0},{"$f":"Kaninchen!F88","v":0},{"$f":"Kaninchen!I88","v":0},null,{"$f":"Kaninchen!M88","v":0},{"$f":"Kaninchen!P88","v":0},0]
["Trächtige Tiere und weibliche Zuchtkaninchen > 6 kg",null,{"$f":"Kaninchen!D89","v":0},{"$f":"Kaninchen!F89","v":0},{"$f":"Kaninchen!I89","v":0},null,{"$f":"Kaninchen!M89","v":0},{"$f":"Kaninchen!P89","v":0},0]
["Mastkaninchen vom Absetzen bis zur Schlachtung Nachzuchtkaninchen (vom Ende der Mast bis 6 Monate)",null,{"$f":"Kaninchen!D90","v":0},{"$f":"Kaninchen!F90","v":0},{"$f":"Kaninchen!I90","v":0},null,{"$f":"Kaninchen!M90","v":0},{"$f":"Kaninchen!P90","v":0},0]
["Erwachsene Rammler",null,{"$f":"Kaninchen!D91","v":0},{"$f":"Kaninchen!F91","v":0},{"$f":"Kaninchen!I91","v":0},null,{"$f":"Kaninchen!M91","v":0},{"$f":"Kaninchen!P91","v":0},0]
["Erwachsene Rammler mit Weibchen zur Paarung",null,{"$f":"Kaninchen!D92","v":0},{"$f":"Kaninchen!F92","v":0},{"$f":"Kaninchen!I92","v":0},null,{"$f":"Kaninchen!M92","v":0},{"$f":"Kaninchen!P92","v":0},0]
[]
["Geweihträger",null,null,null,null,null,null,null,null,"Max Tierzahl ges.","Gehaltene Tiere","Tiere max. / ha","Kg N max."]
["Sikahirsch",null,null,null,null,null,null,null,null,{"$f":"Geweihträger!J4+Geweihträger!J17+Geweihträger!J30+Geweihträger!J43+Geweihträger!J56+Geweihträger!J69","v":0},{"$f":"Geweihträger!I4+Geweihträger!I17+Geweihträger!I30+Geweihträger!I43+Geweihträger!I56+Geweihträger!I69","v":0},{"$f":"2/0.15","v":13.333333333333334},{"$f":"K136/L136*$L$2","v":0}]
["Damhirsch",null,null,null,null,null,null,null,null,{"$f":"Geweihträger!J5+Geweihträger!J18+Geweihträger!J31+Geweihträger!J44+Geweihträger!J57+Geweihträger!J70","v":0},{"$f":"Geweihträger!I5+Geweihträger!I18+Geweihträger!I31+Geweihträger!I44+Geweihträger!I57+Geweihträger!I70","v":0},{"$f":"2/0.15","v":13.333333333333334},0]
["Rothirsch",null,null,null,null,null,null,null,null,{"$f":"Geweihträger!J6+Geweihträger!J19+Geweihträger!J32+Geweihträger!J45+Geweihträger!J58+Geweihträger!J71","v":0},{"$f":"Geweihträger!I6+Geweihträger!I19+Geweihträger!I32+Geweihträger!I45+Geweihträger!I58+Geweihträger!I71","v":0},{"$f":"2/0.3","v":6.666666666666667},0]
["Davidshirsch",null,null,null,null,null,null,null,null,{"$f":"Geweihträger!J7+Geweihträger!J20+Geweihträger!J33+Geweihträger!J46+Geweihträger!J59+Geweihträger!J72","v":0},{"$f":"Geweihträger!I7+Geweihträger!I20+Geweihträger!I33+Geweihträger!I46+Geweihträger!I59+Geweihträger!I72","v":0},{"$f":"2/0.3","v":6.666666666666667},0]
["Mehr als eine Geweihträgerart (MIT Rot- oder Davidshirsch in der Herde)",null,null,null,null,null,null,null,null,{"$f":"Geweihträger!J8+Geweihträger!J21+Geweihträger!J34+Geweihträger!J47+Geweihträger!J60+Geweihträger!J73","v":0},{"$f":"Geweihträger!I8+Geweihträger!I21+Geweihträger!I34+Geweihträger!I47+Geweihträger!I60+Geweihträger!I73","v":0},6.666666666666667,0]
["Mehr als eine Geweihträgerart (OHNE Rot- oder Davidshirsch in der Herde)",null,null,null,null,null,null,null,null,{"$f":"Geweihträger!J9+Geweihträger!J22+Geweihträger!J35+Geweihträger!J48+Geweihträger!J61+Geweihträger!J74","v":0},{"$f":"Geweihträger!I9+Geweihträger!I22+Geweihträger!I35+Geweihträger!I48+Geweihträger!I61+Geweihträger!I74","v":0},{"$f":"2/0.15","v":13.333333333333334},0]
[null,null,null,null,null,null,null,null,null,null,null,"Gesamt Geweihträger",{"$f":"SUM(M136:M141)","v":0}]
[null,null,null,null,null,null,null,null,null,"Quelle: LfL Basisdaten Tabelle 4b (Mrz. 21)"]
[]
["Schweine",null,{"$f":"Schweine!A2","v":"Stallblatt"},{"$f":"Schweine!B2","v":1},null,null,null,null,"Max. Tierzahl","Max Tierzahl ges.","Gehaltene Tiere","Tiere max. / ha","Kg N max."]
["Führende Sau m. Ferkel <40 T.",null,{"$f":"IF(Schweine!D7=0,0,Schweine!D7)","v":0},{"$f":"Schweine!F7","v":0},{"$f":"Schweine!I7","v":0},null,null,null,{"$f":"IF(C146=0,0,IF(SUM(D146:H146)=0,0,MIN(D146:H146)))","v":0},{"$f":"I146+I156+I166+I176+I186","v":0},{"$f":"Schweine!J7+Schweine!J25+Schweine!J43+Schweine!J61+Schweine!J79","v":0},6.5,{"$f":"K146/L146*$L$2","v":0}]
["Ferkel  >40Tage, < 30 kg",null,{"$f":"IF(Schweine!D8=0,0,Schweine!D8)","v":0},{"$f":"Schweine!F8","v":0},{"$f":"Schweine!I8","v":0},null,{"$f":"Schweine!N8","v":0},{"$f":"Schweine!Q8","v":0},{"$f":"IF(C147=0,0,IF(SUM(D147:H147)=0,0,MIN(D147:H147)))","v":0},{"$f":"I147+I157+I167+I177+I187","v":0},{"$f":"Schweine!J8+Schweine!J26+Schweine!J44+Schweine!J62+Schweine!J80","v":0},74,0]
["Mastschweine bis 50 kg",null,{"$f":"IF(Schweine!D9=0,0,Schweine!D9)","v":0},{"$f":"Schweine!F9","v":0},{"$f":"Schweine!I9","v":0},null,{"$f":"Schweine!N9","v":0},{"$f":"Schweine!Q9","v":0},0,0,{"$f":"Schweine!J9+Schweine!J27+Schweine!J45+Schweine!J63+Schweine!J81","v":0},14,0]
["Mastschweine bis 85 kg",null,{"$f":"IF(Schweine!D10=0,0,Schweine!D10)","v":0},{"$f":"Schweine!F10","v":0},{"$f":"Schweine!I10","v":0},null,{"$f":"Schweine!N10","v":0},{"$f":"Schweine!Q10","v":0},0,0,{"$f":"Schweine!J10+Schweine!J28+Schweine!J46+Schweine!J64+Schweine!J82","v":0},14,0]
["Mastschweine bis 110 kg",null,{"$f":"IF(Schweine!D11=0,0,Schweine!D11)","v":0},{"$f":"Schweine!F11","v":0},{"$f":"Schweine!I11","v":0},null,{"$f":"Schweine!N11","v":0},{"$f":"Schweine!Q11","v":0},0,0,{"$f":"Schweine!J11+Schweine!J29+Schweine!J47+Schweine!J65+Schweine!J83","v":0},14,0]
["Mastschweine über 110 kg",null,{"$f":"IF(Schweine!D12=0,0,Schweine!D12)","v":0},{"$f":"Schweine!F12","v":0},{"$f":"Schweine!I12","v":0},null,{"$f":"Schweine!N12","v":0},{"$f":"Schweine!Q12","v":0},0,0,{"$f":"Schweine!J12+Schweine!J30+Schweine!J48+Schweine!J66+Schweine!J84","v":0},14,0]
["Zuchtsauen",null,{"$f":"IF(Schweine!D13=0,0,Schweine!D13)","v":0},{"$f":"Schweine!F13","v":0},{"$f":"Schweine!I13","v":0},null,{"$f":"Schweine!N13","v":0},{"$f":"Schweine!Q13","v":0},0,0,{"$f":"Schweine!J13+Schweine!J31+Schweine!J49+Schweine!J67+Schweine!J85","v":0},6.5,0]
["Eber",null,{"$f":"IF(Schweine!D14=0,0,Schweine!D14)","v":0},{"$f":"Schweine!F14","v":0},{"$f":"Schweine!I14","v":0},null,{"$f":"Schweine!N14","v":0},{"$f":"Schweine!Q14","v":0},0,0,{"$f":"Schweine!J14+Schweine!J32+Schweine!J50+Schweine!J68+Schweine!J86","v":0},6.5,0]
["Eber (natürl. Paarung in Buchten)",null,{"$f":"IF(Schweine!D15=0,0,Schweine!D15)","v":0},{"$f":"Schweine!F15","v":0},{"$f":"Schweine!I15","v":0},null,{"$f":"Schweine!N15","v":0},{"$f":"Schweine!Q15","v":0},0,0,{"$f":"Schweine!J15+Schweine!J33+Schweine!J51+Schweine!J69+Schweine!J87","v":0},6.5,0]
["Schweine",null,{"$f":"Schweine!A20","v":"Stallblatt"},{"$f":"Schweine!B20","v":2},null,null,null,null,"Max. Tierzahl",null,null,{"$f":"CONCATENATE(\"Gesamt \",A145)","v":"Gesamt Schweine"},{"$f":"SUM(M146:M154)","v":0}]
["Führende Sau m. Ferkel <40 T.",null,{"$f":"IF(Schweine!D25=0,0,Schweine!D25)","v":0},{"$f":"Schweine!F25","v":0},{"$f":"Schweine!I25","v":0},null,null,null,{"$f":"IF(C156=0,0,IF(SUM(D156:H156)=0,0,MIN(D156:H156)))","v":0}]
["Ferkel  >40Tage, < 30 kg",null,{"$f":"IF(Schweine!D26=0,0,Schweine!D26)","v":0},{"$f":"Schweine!F26","v":0},{"$f":"Schweine!I26","v":0},null,{"$f":"Schweine!N26","v":0},{"$f":"Schweine!Q26","v":0},{"$f":"IF(C157=0,0,IF(SUM(D157:H157)=0,0,MIN(D157:H157)))","v":0}]
["Mastschweine bis 50 kg",null,{"$f":"IF(Schweine!D27=0,0,Schweine!D27)","v":0},{"$f":"Schweine!F27","v":0},{"$f":"Schweine!I27","v":0},null,{"$f":"Schweine!N27","v":0},{"$f":"Schweine!Q27","v":0},0]
["Mastschweine bis 85 kg",null,{"$f":"IF(Schweine!D28=0,0,Schweine!D28)","v":0},{"$f":"Schweine!F28","v":0},{"$f":"Schweine!I28","v":0},null,{"$f":"Schweine!N28","v":0},{"$f":"Schweine!Q28","v":0},0]
["Mastschweine bis 110 kg",null,{"$f":"IF(Schweine!D29=0,0,Schweine!D29)","v":0},{"$f":"Schweine!F29","v":0},{"$f":"Schweine!I29","v":0},null,{"$f":"Schweine!N29","v":0},{"$f":"Schweine!Q29","v":0},0]
["Mastschweine über 110 kg",null,{"$f":"IF(Schweine!D30=0,0,Schweine!D30)","v":0},{"$f":"Schweine!F30","v":0},{"$f":"Schweine!I30","v":0},null,{"$f":"Schweine!N30","v":0},{"$f":"Schweine!Q30","v":0},0]
["Zuchtsauen",null,{"$f":"IF(Schweine!D31=0,0,Schweine!D31)","v":0},{"$f":"Schweine!F31","v":0},{"$f":"Schweine!I31","v":0},null,{"$f":"Schweine!N31","v":0},{"$f":"Schweine!Q31","v":0},0]
["Eber",null,{"$f":"IF(Schweine!D32=0,0,Schweine!D32)","v":0},{"$f":"Schweine!F32","v":0},{"$f":"Schweine!I32","v":0},null,{"$f":"Schweine!N32","v":0},{"$f":"Schweine!Q32","v":0},0]
["Eber (natürl. Paarung in Buchten)",null,{"$f":"IF(Schweine!D33=0,0,Schweine!D33)","v":0},{"$f":"Schweine!F33","v":0},{"$f":"Schweine!I33","v":0},null,{"$f":"Schweine!N33","v":0},{"$f":"Schweine!Q33","v":0},0]
["Schweine",null,{"$f":"Schweine!A38","v":"Stallblatt"},{"$f":"Schweine!B38","v":3},null,null,null,null,"Max. Tierzahl"]
["Führende Sau m. Ferkel <40 T.",null,{"$f":"IF(Schweine!D43=0,0,Schweine!D43)","v":0},{"$f":"Schweine!F43","v":0},{"$f":"Schweine!I43","v":0},null,null,null,{"$f":"IF(C166=0,0,IF(SUM(D166:H166)=0,0,MIN(D166:H166)))","v":0}]
["Ferkel  >40Tage, < 30 kg",null,{"$f":"IF(Schweine!D44=0,0,Schweine!D44)","v":0},{"$f":"Schweine!F44","v":0},{"$f":"Schweine!I44","v":0},null,{"$f":"Schweine!N44","v":0},{"$f":"Schweine!Q44","v":0},{"$f":"IF(C167=0,0,IF(SUM(D167:H167)=0,0,MIN(D167:H167)))","v":0}]
["Mastschweine bis 50 kg",null,{"$f":"IF(Schweine!D45=0,0,Schweine!D45)","v":0},{"$f":"Schweine!F45","v":0},{"$f":"Schweine!I45","v":0},null,{"$f":"Schweine!N45","v":0},{"$f":"Schweine!Q45","v":0},0]
["Mastschweine bis 85 kg",null,{"$f":"IF(Schweine!D46=0,0,Schweine!D46)","v":0},{"$f":"Schweine!F46","v":0},{"$f":"Schweine!I46","v":0},null,{"$f":"Schweine!N46","v":0},{"$f":"Schweine!Q46","v":0},0]
["Mastschweine bis 110 kg",null,{"$f":"IF(Schweine!D47=0,0,Schweine!D47)","v":0},{"$f":"Schweine!F47","v":0},{"$f":"Schweine!I47","v":0},null,{"$f":"Schweine!N47","v":0},{"$f":"Schweine!Q47","v":0},0]
["Mastschweine über 110 kg",null,{"$f":"IF(Schweine!D48=0,0,Schweine!D48)","v":0},{"$f":"Schweine!F48","v":0},{"$f":"Schweine!I48","v":0},null,{"$f":"Schweine!N48","v":0},{"$f":"Schweine!Q48","v":0},0]
["Zuchtsauen",null,{"$f":"IF(Schweine!D49=0,0,Schweine!D49)","v":0},{"$f":"Schweine!F49","v":0},{"$f":"Schweine!I49","v":0},null,{"$f":"Schweine!N49","v":0},{"$f":"Schweine!Q49","v":0},0]
["Eber",null,{"$f":"IF(Schweine!D50=0,0,Schweine!D50)","v":0},{"$f":"Schweine!F50","v":0},{"$f":"Schweine!I50","v":0},null,{"$f":"Schweine!N50","v":0},{"$f":"Schweine!Q50","v":0},0]
["Eber (natürl. Paarung in Buchten)",null,{"$f":"IF(Schweine!D51=0,0,Schweine!D51)","v":0},{"$f":"Schweine!F51","v":0},{"$f":"Schweine!I51","v":0},null,{"$f":"Schweine!N51","v":0},{"$f":"Schweine!Q51","v":0},0]
["Schweine",null,{"$f":"Schweine!A56","v":"Stallblatt"},{"$f":"Schweine!B56","v":4},null,null,null,null,"Max. Tierzahl"]
["Führende Sau m. Ferkel <40 T.",null,{"$f":"IF(Schweine!D61=0,0,Schweine!D61)","v":0},{"$f":"Schweine!F61","v":0},{"$f":"Schweine!I61","v":0},null,null,null,{"$f":"IF(C176=0,0,IF(SUM(D176:H176)=0,0,MIN(D176:H176)))","v":0}]
["Ferkel  >40Tage, < 30 kg",null,{"$f":"IF(Schweine!D62=0,0,Schweine!D62)","v":0},{"$f":"Schweine!F62","v":0},{"$f":"Schweine!I62","v":0},null,{"$f":"Schweine!N62","v":0},{"$f":"Schweine!Q62","v":0},{"$f":"IF(C177=0,0,IF(SUM(D177:H177)=0,0,MIN(D177:H177)))","v":0}]
["Mastschweine bis 50 kg",null,{"$f":"IF(Schweine!D63=0,0,Schweine!D63)","v":0},{"$f":"Schweine!F63","v":0},{"$f":"Schweine!I63","v":0},null,{"$f":"Schweine!N63","v":0},{"$f":"Schweine!Q63","v":0},0]
["Mastschweine bis 85 kg",null,{"$f":"IF(Schweine!D64=0,0,Schweine!D64)","v":0},{"$f":"Schweine!F64","v":0},{"$f":"Schweine!I64","v":0},null,{"$f":"Schweine!N64","v":0},{"$f":"Schweine!Q64","v":0},0]
["Mastschweine bis 110 kg",null,{"$f":"IF(Schweine!D65=0,0,Schweine!D65)","v":0},{"$f":"Schweine!F65","v":0},{"$f":"Schweine!I65","v":0},null,{"$f":"Schweine!N65","v":0},{"$f":"Schweine!Q65","v":0},0]
["Mastschweine über 110 kg",null,{"$f":"IF(Schweine!D66=0,0,Schweine!D66)","v":0},{"$f":"Schweine!F66","v":0},{"$f":"Schweine!I66","v":0},null,{"$f":"Schweine!N66","v":0},{"$f":"Schweine!Q66","v":0},0]
["Zuchtsauen",null,{"$f":"IF(Schweine!D67=0,0,Schweine!D67)","v":0},{"$f":"Schweine!F67","v":0},{"$f":"Schweine!I67","v":0},null,{"$f":"Schweine!N67","v":0},{"$f":"Schweine!Q67","v":0},0]
["Eber",null,{"$f":"IF(Schweine!D68=0,0,Schweine!D68)","v":0},{"$f":"Schweine!F68","v":0},{"$f":"Schweine!I68","v":0},null,{"$f":"Schweine!N68","v":0},{"$f":"Schweine!Q68","v":0},0]
["Eber (natürl. Paarung in Buchten)",null,{"$f":"IF(Schweine!D69=0,0,Schweine!D69)","v":0},{"$f":"Schweine!F69","v":0},{"$f":"Schweine!I69","v":0},null,{"$f":"Schweine!N69","v":0},{"$f":"Schweine!Q69","v":0},0]
["Schweine",null,{"$f":"Schweine!A74","v":"Stallblatt"},{"$f":"Schweine!B74","v":5},null,null,null,null,"Max. Tierzahl"]
["Führende Sau m. Ferkel <40 T.",null,{"$f":"IF(Schweine!D79=0,0,Schweine!D79)","v":0},{"$f":"Schweine!F79","v":0},{"$f":"Schweine!I79","v":0},null,null,null,{"$f":"IF(C186=0,0,IF(SUM(D186:H186)=0,0,MIN(D186:H186)))","v":0}]
["Ferkel  >40Tage, < 30 kg",null,{"$f":"IF(Schweine!D80=0,0,Schweine!D80)","v":0},{"$f":"Schweine!F80","v":0},{"$f":"Schweine!I80","v":0},null,{"$f":"Schweine!N80","v":0},{"$f":"Schweine!Q80","v":0},{"$f":"IF(C187=0,0,IF(SUM(D187:H187)=0,0,MIN(D187:H187)))","v":0}]
["Mastschweine bis 50 kg",null,{"$f":"IF(Schweine!D81=0,0,Schweine!D81)","v":0},{"$f":"Schweine!F81","v":0},{"$f":"Schweine!I81","v":0},null,{"$f":"Schweine!N81","v":0},{"$f":"Schweine!Q81","v":0},0]
["Mastschweine bis 85 kg",null,{"$f":"IF(Schweine!D82=0,0,Schweine!D82)","v":0},{"$f":"Schweine!F82","v":0},{"$f":"Schweine!I82","v":0},null,{"$f":"Schweine!N82","v":0},{"$f":"Schweine!Q82","v":0},0]
["Mastschweine bis 110 kg",null,{"$f":"IF(Schweine!D83=0,0,Schweine!D83)","v":0},{"$f":"Schweine!F83","v":0},{"$f":"Schweine!I83","v":0},null,{"$f":"Schweine!N83","v":0},{"$f":"Schweine!Q83","v":0},0]
["Mastschweine über 110 kg",null,{"$f":"IF(Schweine!D84=0,0,Schweine!D84)","v":0},{"$f":"Schweine!F84","v":0},{"$f":"Schweine!I84","v":0},null,{"$f":"Schweine!N84","v":0},{"$f":"Schweine!Q84","v":0},0]
["Zuchtsauen",null,{"$f":"IF(Schweine!D85=0,0,Schweine!D85)","v":0},{"$f":"Schweine!F85","v":0},{"$f":"Schweine!I85","v":0},null,{"$f":"Schweine!N85","v":0},{"$f":"Schweine!Q85","v":0},0]
["Eber",null,{"$f":"IF(Schweine!D86=0,0,Schweine!D86)","v":0},{"$f":"Schweine!F86","v":0},{"$f":"Schweine!I86","v":0},null,{"$f":"Schweine!N86","v":0},{"$f":"Schweine!Q86","v":0},0]
["Eber (natürl. Paarung in Buchten)",null,{"$f":"IF(Schweine!D87=0,0,Schweine!D87)","v":0},{"$f":"Schweine!F87","v":0},{"$f":"Schweine!I87","v":0},null,{"$f":"Schweine!N87","v":0},{"$f":"Schweine!Q87","v":0},0]
[]
["2. Geflügel"]
["Legehennen"]
["Stall","Ebenen","Fläche","Stangen","Futtertöge","Tränken","Nest Sum","Auslauf","Luken","Scharraum","Max. Tierzahl","Gehaltene Tiere","Tiere max. / ha","Kg N max."]
[{"$f":"Legehennen!A6","v":0},{"$f":"Legehennen!L6","v":0},{"$f":"Legehennen!P6","v":0},{"$f":"Legehennen!S6","v":0},{"$f":"Legehennen!AR6","v":3000},{"$f":"Legehennen!BB6","v":3000},{"$f":"Legehennen!X6","v":0},{"$f":"Legehennen!AI6","v":3000},{"$f":"Legehennen!AA6","v":0},{"$f":"Legehennen!AD6","v":0},{"$f":"IF(SUM(B199:J199)=0,0,MIN(B199:J199))","v":0},{"$f":"Legehennen!F6","v":0},230,{"$f":"L199/M199*$L$2","v":0}]
[{"$f":"Legehennen!A7","v":0},{"$f":"Legehennen!L7","v":0},{"$f":"Legehennen!P7","v":0},{"$f":"Legehennen!S7","v":0},{"$f":"Legehennen!AR7","v":0},{"$f":"Legehennen!BB7","v":0},{"$f":"Legehennen!X7","v":0},{"$f":"Legehennen!AI7","v":0},{"$f":"Legehennen!AA7","v":0},{"$f":"Legehennen!AD7","v":0},0,{"$f":"Legehennen!F7","v":0},230,0]
[{"$f":"Legehennen!A8","v":0},{"$f":"Legehennen!L8","v":0},{"$f":"Legehennen!P8","v":0},{"$f":"Legehennen!S8","v":0},{"$f":"Legehennen!AR8","v":0},{"$f":"Legehennen!BB8","v":0},{"$f":"Legehennen!X8","v":0},{"$f":"Legehennen!AI8","v":0},{"$f":"Legehennen!AA8","v":0},{"$f":"Legehennen!AD8","v":0},0,{"$f":"Legehennen!F8","v":0},230,0]
[{"$f":"Legehennen!A9","v":0},{"$f":"Legehennen!L9","v":0},{"$f":"Legehennen!P9","v":0},{"$f":"Legehennen!S9","v":0},{"$f":"Legehennen!AR9","v":0},{"$f":"Legehennen!BB9","v":0},{"$f":"Legehennen!X9","v":0},{"$f":"Legehennen!AI9","v":0},{"$f":"Legehennen!AA9","v":0},{"$f":"Legehennen!AD9","v":0},0,{"$f":"Legehennen!F9","v":0},230,0]
[{"$f":"Legehennen!A10","v":0},{"$f":"Legehennen!L10","v":0},{"$f":"Legehennen!P10","v":0},{"$f":"Legehennen!S10","v":0},{"$f":"Legehennen!AR10","v":0},{"$f":"Legehennen!BB10","v":0},{"$f":"Legehennen!X10","v":0},{"$f":"Legehennen!AI10","v":0},{"$f":"Legehennen!AA10","v":0},{"$f":"Legehennen!AD10","v":0},0,{"$f":"Legehennen!F10","v":0},230,0]
[{"$f":"Legehennen!A11","v":0},{"$f":"Legehennen!L11","v":0},{"$f":"Legehennen!P11","v":0},{"$f":"Legehennen!S11","v":0},{"$f":"Legehennen!AR11","v":0},{"$f":"Legehennen!BB11","v":0},{"$f":"Legehennen!X11","v":0},{"$f":"Legehennen!AI11","v":0},{"$f":"Legehennen!AA11","v":0},{"$f":"Legehennen!AD11","v":0},0,{"$f":"Legehennen!F11","v":0},230,0]
[{"$f":"Legehennen!A12","v":0},{"$f":"Legehennen!L12","v":0},{"$f":"Legehennen!P12","v":0},{"$f":"Legehennen!S12","v":0},{"$f":"Legehennen!AR12","v":0},{"$f":"Legehennen!BB12","v":0},{"$f":"Legehennen!X12","v":0},{"$f":"Legehennen!AI12","v":0},{"$f":"Legehennen!AA12","v":0},{"$f":"Legehennen!AD12","v":0},0,{"$f":"Legehennen!F12","v":0},230,0]
[{"$f":"Legehennen!A13","v":0},{"$f":"Legehennen!L13","v":0},{"$f":"Legehennen!P13","v":0},{"$f":"Legehennen!S13","v":0},{"$f":"Legehennen!AR13","v":0},{"$f":"Legehennen!BB13","v":0},{"$f":"Legehennen!X13","v":0},{"$f":"Legehennen!AI13","v":0},{"$f":"Legehennen!AA13","v":0},{"$f":"Legehennen!AD13","v":0},0,{"$f":"Legehennen!F13","v":0},230,0]
[{"$f":"Legehennen!A14","v":0},{"$f":"Legehennen!L14","v":0},{"$f":"Legehennen!P14","v":0},{"$f":"Legehennen!S14","v":0},{"$f":"Legehennen!AR14","v":0},{"$f":"Legehennen!BB14","v":0},{"$f":"Legehennen!X14","v":0},{"$f":"Legehennen!AI14","v":0},{"$f":"Legehennen!AA14","v":0},{"$f":"Legehennen!AD14","v":0},0,{"$f":"Legehennen!F14","v":0},230,0]
[{"$f":"Legehennen!A15","v":0},{"$f":"Legehennen!L15","v":0},{"$f":"Legehennen!P15","v":0},{"$f":"Legehennen!S15","v":0},{"$f":"Legehennen!AR15","v":0},{"$f":"Legehennen!BB15","v":0},{"$f":"Legehennen!X15","v":0},{"$f":"Legehennen!AI15","v":0},{"$f":"Legehennen!AA15","v":0},{"$f":"Legehennen!AD15","v":0},0,{"$f":"Legehennen!F15","v":0},230,0]
[{"$f":"Legehennen!A16","v":0},{"$f":"Legehennen!L16","v":0},{"$f":"Legehennen!P16","v":0},{"$f":"Legehennen!S16","v":0},{"$f":"Legehennen!AR16","v":0},{"$f":"Legehennen!BB16","v":0},{"$f":"Legehennen!X16","v":0},{"$f":"Legehennen!AI16","v":0},{"$f":"Legehennen!AA16","v":0},{"$f":"Legehennen!AD16","v":0},0,{"$f":"Legehennen!F16","v":0},230,0]
[{"$f":"Legehennen!A17","v":0},{"$f":"Legehennen!L17","v":0},{"$f":"Legehennen!P17","v":0},{"$f":"Legehennen!S17","v":0},{"$f":"Legehennen!AR17","v":0},{"$f":"Legehennen!BB17","v":0},{"$f":"Legehennen!X17","v":0},{"$f":"Legehennen!AI17","v":0},{"$f":"Legehennen!AA17","v":0},{"$f":"Legehennen!AD17","v":0},0,{"$f":"Legehennen!F17","v":0},230,0]
[{"$f":"Legehennen!A18","v":0},{"$f":"Legehennen!L18","v":0},{"$f":"Legehennen!P18","v":0},{"$f":"Legehennen!S18","v":0},{"$f":"Legehennen!AR18","v":0},{"$f":"Legehennen!BB18","v":0},{"$f":"Legehennen!X18","v":0},{"$f":"Legehennen!AI18","v":0},{"$f":"Legehennen!AA18","v":0},{"$f":"Legehennen!AD18","v":0},0,{"$f":"Legehennen!F18","v":0},230,0]
[{"$f":"Legehennen!A19","v":0},{"$f":"Legehennen!L19","v":0},{"$f":"Legehennen!P19","v":0},{"$f":"Legehennen!S19","v":0},{"$f":"Legehennen!AR19","v":0},{"$f":"Legehennen!BB19","v":0},{"$f":"Legehennen!X19","v":0},{"$f":"Legehennen!AI19","v":0},{"$f":"Legehennen!AA19","v":0},{"$f":"Legehennen!AD19","v":0},0,{"$f":"Legehennen!F19","v":0},230,0]
[{"$f":"Legehennen!A20","v":0},{"$f":"Legehennen!L20","v":0},{"$f":"Legehennen!P20","v":0},{"$f":"Legehennen!S20","v":0},{"$f":"Legehennen!AR20","v":0},{"$f":"Legehennen!BB20","v":0},{"$f":"Legehennen!X20","v":0},{"$f":"Legehennen!AI20","v":0},{"$f":"Legehennen!AA20","v":0},{"$f":"Legehennen!AD20","v":0},0,{"$f":"Legehennen!F20","v":0},230,0]
[{"$f":"Legehennen!A21","v":0},{"$f":"Legehennen!L21","v":0},{"$f":"Legehennen!P21","v":0},{"$f":"Legehennen!S21","v":0},{"$f":"Legehennen!AR21","v":0},{"$f":"Legehennen!BB21","v":0},{"$f":"Legehennen!X21","v":0},{"$f":"Legehennen!AI21","v":0},{"$f":"Legehennen!AA21","v":0},{"$f":"Legehennen!AD21","v":0},0,{"$f":"Legehennen!F21","v":0},230,0]
[{"$f":"Legehennen!A22","v":0},{"$f":"Legehennen!L22","v":0},{"$f":"Legehennen!P22","v":0},{"$f":"Legehennen!S22","v":0},{"$f":"Legehennen!AR22","v":0},{"$f":"Legehennen!BB22","v":0},{"$f":"Legehennen!X22","v":0},{"$f":"Legehennen!AI22","v":0},{"$f":"Legehennen!AA22","v":0},{"$f":"Legehennen!AD22","v":0},0,{"$f":"Legehennen!F22","v":0},230,0]
[null,null,null,null,null,null,null,null,null,null,null,null,{"$f":"CONCATENATE(\"Gesamt \",A197)","v":"Gesamt Legehennen"},{"$f":"SUM(N199:N215)","v":0}]
[]
["Junghennen-Bruderhähne"]
["Stall","Ebenen","Tiere Stall","Sitzgelegenht.","Futtertöge","Tränken","Luken \n(Stall-KSR)","Scharraum","Auslauföffnungen","Auslauf","Max. Tierzahl","Gehaltene Tiere","Tiere max. / ha","Kg N max."]
[{"$f":"'Junghennen-Bruderhähne'!A6","v":0},{"$f":"'Junghennen-Bruderhähne'!L6","v":0},{"$f":"'Junghennen-Bruderhähne'!P6","v":0},{"$f":"'Junghennen-Bruderhähne'!W6","v":0},{"$f":"'Junghennen-Bruderhähne'!AQ6","v":8000},{"$f":"'Junghennen-Bruderhähne'!BA6","v":8000},{"$f":"'Junghennen-Bruderhähne'!Z6","v":0},{"$f":"'Junghennen-Bruderhähne'!AC6","v":0},{"$f":"'Junghennen-Bruderhähne'!AF6","v":0},{"$f":"'Junghennen-Bruderhähne'!AH6","v":0},{"$f":"IF(SUM(B220:I220)=0,0,MIN(B220:I220))","v":0},{"$f":"'Junghennen-Bruderhähne'!E6","v":0},580,{"$f":"L220/M220*$L$2","v":0}]
[{"$f":"'Junghennen-Bruderhähne'!A7","v":0},{"$f":"'Junghennen-Bruderhähne'!L7","v":0},{"$f":"'Junghennen-Bruderhähne'!P7","v":0},{"$f":"'Junghennen-Bruderhähne'!W7","v":0},{"$f":"'Junghennen-Bruderhähne'!AQ7","v":0},{"$f":"'Junghennen-Bruderhähne'!BA7","v":0},{"$f":"'Junghennen-Bruderhähne'!Z7","v":0},{"$f":"'Junghennen-Bruderhähne'!AC7","v":0},{"$f":"'Junghennen-Bruderhähne'!AF7","v":0},{"$f":"'Junghennen-Bruderhähne'!AH7","v":0},{"$f":"IF(SUM(B221:I221)=0,0,MIN(B221:I221))","v":0},{"$f":"'Junghennen-Bruderhähne'!E7","v":0},580,0]
[{"$f":"'Junghennen-Bruderhähne'!A8","v":0},{"$f":"'Junghennen-Bruderhähne'!L8","v":0},{"$f":"'Junghennen-Bruderhähne'!P8","v":0},{"$f":"'Junghennen-Bruderhähne'!W8","v":0},{"$f":"'Junghennen-Bruderhähne'!AQ8","v":0},{"$f":"'Junghennen-Bruderhähne'!BA8","v":0},{"$f":"'Junghennen-Bruderhähne'!Z8","v":0},{"$f":"'Junghennen-Bruderhähne'!AC8","v":0},{"$f":"'Junghennen-Bruderhähne'!AF8","v":0},{"$f":"'Junghennen-Bruderhähne'!AH8","v":0},0,{"$f":"'Junghennen-Bruderhähne'!E8","v":0},580,0]
[{"$f":"'Junghennen-Bruderhähne'!A9","v":0},{"$f":"'Junghennen-Bruderhähne'!L9","v":0},{"$f":"'Junghennen-Bruderhähne'!P9","v":0},{"$f":"'Junghennen-Bruderhähne'!W9","v":0},{"$f":"'Junghennen-Bruderhähne'!AQ9","v":0},{"$f":"'Junghennen-Bruderhähne'!BA9","v":0},{"$f":"'Junghennen-Bruderhähne'!Z9","v":0},{"$f":"'Junghennen-Bruderhähne'!AC9","v":0},{"$f":"'Junghennen-Bruderhähne'!AF9","v":0},{"$f":"'Junghennen-Bruderhähne'!AH9","v":0},0,{"$f":"'Junghennen-Bruderhähne'!E9","v":0},580,0]
[{"$f":"'Junghennen-Bruderhähne'!A10","v":0},{"$f":"'Junghennen-Bruderhähne'!L10","v":0},{"$f":"'Junghennen-Bruderhähne'!P10","v":0},{"$f":"'Junghennen-Bruderhähne'!W10","v":0},{"$f":"'Junghennen-Bruderhähne'!AQ10","v":0},{"$f":"'Junghennen-Bruderhähne'!BA10","v":0},{"$f":"'Junghennen-Bruderhähne'!Z10","v":0},{"$f":"'Junghennen-Bruderhähne'!AC10","v":0},{"$f":"'Junghennen-Bruderhähne'!AF10","v":0},{"$f":"'Junghennen-Bruderhähne'!AH10","v":0},0,{"$f":"'Junghennen-Bruderhähne'!E10","v":0},580,0]
[{"$f":"'Junghennen-Bruderhähne'!A11","v":0},{"$f":"'Junghennen-Bruderhähne'!L11","v":0},{"$f":"'Junghennen-Bruderhähne'!P11","v":0},{"$f":"'Junghennen-Bruderhähne'!W11","v":0},{"$f":"'Junghennen-Bruderhähne'!AQ11","v":0},{"$f":"'Junghennen-Bruderhähne'!BA11","v":0},{"$f":"'Junghennen-Bruderhähne'!Z11","v":0},{"$f":"'Junghennen-Bruderhähne'!AC11","v":0},{"$f":"'Junghennen-Bruderhähne'!AF11","v":0},{"$f":"'Junghennen-Bruderhähne'!AH11","v":0},0,{"$f":"'Junghennen-Bruderhähne'!E11","v":0},580,0]
[{"$f":"'Junghennen-Bruderhähne'!A12","v":0},{"$f":"'Junghennen-Bruderhähne'!L12","v":0},{"$f":"'Junghennen-Bruderhähne'!P12","v":0},{"$f":"'Junghennen-Bruderhähne'!W12","v":0},{"$f":"'Junghennen-Bruderhähne'!AQ12","v":0},{"$f":"'Junghennen-Bruderhähne'!BA12","v":0},{"$f":"'Junghennen-Bruderhähne'!Z12","v":0},{"$f":"'Junghennen-Bruderhähne'!AC12","v":0},{"$f":"'Junghennen-Bruderhähne'!AF12","v":0},{"$f":"'Junghennen-Bruderhähne'!AH12","v":0},0,{"$f":"'Junghennen-Bruderhähne'!E12","v":0},580,0]
[{"$f":"'Junghennen-Bruderhähne'!A13","v":0},{"$f":"'Junghennen-Bruderhähne'!L13","v":0},{"$f":"'Junghennen-Bruderhähne'!P13","v":0},{"$f":"'Junghennen-Bruderhähne'!W13","v":0},{"$f":"'Junghennen-Bruderhähne'!AQ13","v":0},{"$f":"'Junghennen-Bruderhähne'!BA13","v":0},{"$f":"'Junghennen-Bruderhähne'!Z13","v":0},{"$f":"'Junghennen-Bruderhähne'!AC13","v":0},{"$f":"'Junghennen-Bruderhähne'!AF13","v":0},{"$f":"'Junghennen-Bruderhähne'!AH13","v":0},0,{"$f":"'Junghennen-Bruderhähne'!E13","v":0},580,0]
[{"$f":"'Junghennen-Bruderhähne'!A14","v":"Bewegl. Ställe"}]
[{"$f":"'Junghennen-Bruderhähne'!A15","v":0},{"$f":"'Junghennen-Bruderhähne'!L15","v":0},{"$f":"'Junghennen-Bruderhähne'!P15","v":0},{"$f":"'Junghennen-Bruderhähne'!W15","v":0},{"$f":"'Junghennen-Bruderhähne'!AQ15","v":0},{"$f":"'Junghennen-Bruderhähne'!BA15","v":0},{"$f":"'Junghennen-Bruderhähne'!Z15","v":0},{"$f":"'Junghennen-Bruderhähne'!AC15","v":0},{"$f":"'Junghennen-Bruderhähne'!AF15","v":0},{"$f":"'Junghennen-Bruderhähne'!AH15","v":0},0,{"$f":"'Junghennen-Bruderhähne'!E15","v":0},580,{"$f":"L229/M229*$L$2","v":0}]
[{"$f":"'Junghennen-Bruderhähne'!A16","v":0},{"$f":"'Junghennen-Bruderhähne'!L16","v":0},{"$f":"'Junghennen-Bruderhähne'!P16","v":0},{"$f":"'Junghennen-Bruderhähne'!W16","v":0},{"$f":"'Junghennen-Bruderhähne'!AQ16","v":0},{"$f":"'Junghennen-Bruderhähne'!BA16","v":0},{"$f":"'Junghennen-Bruderhähne'!Z16","v":0},{"$f":"'Junghennen-Bruderhähne'!AC16","v":0},{"$f":"'Junghennen-Bruderhähne'!AF16","v":0},{"$f":"'Junghennen-Bruderhähne'!AH16","v":0},0,{"$f":"'Junghennen-Bruderhähne'!E16","v":0},580,0]
[{"$f":"'Junghennen-Bruderhähne'!A17","v":0},{"$f":"'Junghennen-Bruderhähne'!L17","v":0},{"$f":"'Junghennen-Bruderhähne'!P17","v":0},{"$f":"'Junghennen-Bruderhähne'!W17","v":0},{"$f":"'Junghennen-Bruderhähne'!AQ17","v":0},{"$f":"'Junghennen-Bruderhähne'!BA17","v":0},{"$f":"'Junghennen-Bruderhähne'!Z17","v":0},{"$f":"'Junghennen-Bruderhähne'!AC17","v":0},{"$f":"'Junghennen-Bruderhähne'!AF17","v":0},{"$f":"'Junghennen-Bruderhähne'!AH17","v":0},0,{"$f":"'Junghennen-Bruderhähne'!E17","v":0},580,0]
[{"$f":"'Junghennen-Bruderhähne'!A18","v":0},{"$f":"'Junghennen-Bruderhähne'!L18","v":0},{"$f":"'Junghennen-Bruderhähne'!P18","v":0},{"$f":"'Junghennen-Bruderhähne'!W18","v":0},{"$f":"'Junghennen-Bruderhähne'!AQ18","v":0},{"$f":"'Junghennen-Bruderhähne'!BA18","v":0},{"$f":"'Junghennen-Bruderhähne'!Z18","v":0},{"$f":"'Junghennen-Bruderhähne'!AC18","v":0},{"$f":"'Junghennen-Bruderhähne'!AF18","v":0},{"$f":"'Junghennen-Bruderhähne'!AH18","v":0},0,{"$f":"'Junghennen-Bruderhähne'!E18","v":0},580,0]
[{"$f":"'Junghennen-Bruderhähne'!A19","v":0},{"$f":"'Junghennen-Bruderhähne'!L19","v":0},{"$f":"'Junghennen-Bruderhähne'!P19","v":0},{"$f":"'Junghennen-Bruderhähne'!W19","v":0},{"$f":"'Junghennen-Bruderhähne'!AQ19","v":0},{"$f":"'Junghennen-Bruderhähne'!BA19","v":0},{"$f":"'Junghennen-Bruderhähne'!Z19","v":0},{"$f":"'Junghennen-Bruderhähne'!AC19","v":0},{"$f":"'Junghennen-Bruderhähne'!AF19","v":0},{"$f":"'Junghennen-Bruderhähne'!AH19","v":0},0,{"$f":"'Junghennen-Bruderhähne'!E19","v":0},580,0]
[{"$f":"'Junghennen-Bruderhähne'!A20","v":0},{"$f":"'Junghennen-Bruderhähne'!L20","v":0},{"$f":"'Junghennen-Bruderhähne'!P20","v":0},{"$f":"'Junghennen-Bruderhähne'!W20","v":0},{"$f":"'Junghennen-Bruderhähne'!AQ20","v":0},{"$f":"'Junghennen-Bruderhähne'!BA20","v":0},{"$f":"'Junghennen-Bruderhähne'!Z20","v":0},{"$f":"'Junghennen-Bruderhähne'!AC20","v":0},{"$f":"'Junghennen-Bruderhähne'!AF20","v":0},{"$f":"'Junghennen-Bruderhähne'!AH20","v":0},0,{"$f":"'Junghennen-Bruderhähne'!E20","v":0},580,0]
[{"$f":"'Junghennen-Bruderhähne'!A21","v":0},{"$f":"'Junghennen-Bruderhähne'!L21","v":0},{"$f":"'Junghennen-Bruderhähne'!P21","v":0},{"$f":"'Junghennen-Bruderhähne'!W21","v":0},{"$f":"'Junghennen-Bruderhähne'!AQ21","v":0},{"$f":"'Junghennen-Bruderhähne'!BA21","v":0},{"$f":"'Junghennen-Bruderhähne'!Z21","v":0},{"$f":"'Junghennen-Bruderhähne'!AC21","v":0},{"$f":"'Junghennen-Bruderhähne'!AF21","v":0},{"$f":"'Junghennen-Bruderhähne'!AH21","v":0},0,{"$f":"'Junghennen-Bruderhähne'!E21","v":0},580,0]
[{"$f":"'Junghennen-Bruderhähne'!A22","v":0},{"$f":"'Junghennen-Bruderhähne'!L22","v":0},{"$f":"'Junghennen-Bruderhähne'!P22","v":0},{"$f":"'Junghennen-Bruderhähne'!W22","v":0},{"$f":"'Junghennen-Bruderhähne'!AQ22","v":0},{"$f":"'Junghennen-Bruderhähne'!BA22","v":0},{"$f":"'Junghennen-Bruderhähne'!Z22","v":0},{"$f":"'Junghennen-Bruderhähne'!AC22","v":0},{"$f":"'Junghennen-Bruderhähne'!AF22","v":0},{"$f":"'Junghennen-Bruderhähne'!AH22","v":0},0,{"$f":"'Junghennen-Bruderhähne'!E22","v":0},580,0]
[null,null,null,null,null,null,null,null,null,null,null,null,{"$f":"CONCATENATE(\"Gesamt \",A218)","v":"Gesamt Junghennen-Bruderhähne"},{"$f":"SUM(N220:N236)","v":0}]
[]
["Mastgeflügel"]
["Stall","Ebenen","Tiere Stall","Sitzgelegenht.","Futtertöge","Tränken","Luken \n(Stall-KSR)","Scharraum","Auslauföffnungen","Auslauf","Max. Tierzahl","Gehaltene Tiere","Tiere max. / ha","Kg N max."]
[{"$f":"Masthähnchen!A6","v":0},{"$f":"Masthähnchen!L6","v":0},{"$f":"Masthähnchen!P6","v":0},{"$f":"Masthähnchen!W6","v":0},{"$f":"Masthähnchen!AQ6","v":0},{"$f":"Masthähnchen!BA6","v":0},{"$f":"Masthähnchen!Z6","v":0},{"$f":"Masthähnchen!AC6","v":0},{"$f":"Masthähnchen!AF6","v":0},{"$f":"Masthähnchen!AH6","v":0},{"$f":"IF(SUM(B241:J241)=0,0,MIN(B241:J241))","v":0},{"$f":"Masthähnchen!E6","v":0},580,{"$f":"L241/M241*$L$2","v":0}]
[{"$f":"Masthähnchen!A7","v":0},{"$f":"Masthähnchen!L7","v":0},{"$f":"Masthähnchen!P7","v":0},{"$f":"Masthähnchen!W7","v":0},{"$f":"Masthähnchen!AQ7","v":0},{"$f":"Masthähnchen!BA7","v":0},{"$f":"Masthähnchen!Z7","v":0},{"$f":"Masthähnchen!AC7","v":0},{"$f":"Masthähnchen!AF7","v":0},{"$f":"Masthähnchen!AH7","v":0},0,{"$f":"Masthähnchen!E7","v":0},580,0]
[{"$f":"Masthähnchen!A8","v":0},{"$f":"Masthähnchen!L8","v":0},{"$f":"Masthähnchen!P8","v":0},{"$f":"Masthähnchen!W8","v":0},{"$f":"Masthähnchen!AQ8","v":0},{"$f":"Masthähnchen!BA8","v":0},{"$f":"Masthähnchen!Z8","v":0},{"$f":"Masthähnchen!AC8","v":0},{"$f":"Masthähnchen!AF8","v":0},{"$f":"Masthähnchen!AH8","v":0},0,{"$f":"Masthähnchen!E8","v":0},580,0]
[{"$f":"Masthähnchen!A9","v":0},{"$f":"Masthähnchen!L9","v":0},{"$f":"Masthähnchen!P9","v":0},{"$f":"Masthähnchen!W9","v":0},{"$f":"Masthähnchen!AQ9","v":0},{"$f":"Masthähnchen!BA9","v":0},{"$f":"Masthähnchen!Z9","v":0},{"$f":"Masthähnchen!AC9","v":0},{"$f":"Masthähnchen!AF9","v":0},{"$f":"Masthähnchen!AH9","v":0},0,{"$f":"Masthähnchen!E9","v":0},580,0]
[{"$f":"Masthähnchen!A10","v":0},{"$f":"Masthähnchen!L10","v":0},{"$f":"Masthähnchen!P10","v":0},{"$f":"Masthähnchen!W10","v":0},{"$f":"Masthähnchen!AQ10","v":0},{"$f":"Masthähnchen!BA10","v":0},{"$f":"Masthähnchen!Z10","v":0},{"$f":"Masthähnchen!AC10","v":0},{"$f":"Masthähnchen!AF10","v":0},{"$f":"Masthähnchen!AH10","v":0},0,{"$f":"Masthähnchen!E10","v":0},580,0]
[{"$f":"Masthähnchen!A11","v":0},{"$f":"Masthähnchen!L11","v":0},{"$f":"Masthähnchen!P11","v":0},{"$f":"Masthähnchen!W11","v":0},{"$f":"Masthähnchen!AQ11","v":0},{"$f":"Masthähnchen!BA11","v":0},{"$f":"Masthähnchen!Z11","v":0},{"$f":"Masthähnchen!AC11","v":0},{"$f":"Masthähnchen!AF11","v":0},{"$f":"Masthähnchen!AH11","v":0},0,{"$f":"Masthähnchen!E11","v":0},580,0]
[{"$f":"Masthähnchen!A12","v":0},{"$f":"Masthähnchen!L12","v":0},{"$f":"Masthähnchen!P12","v":0},{"$f":"Masthähnchen!W12","v":0},{"$f":"Masthähnchen!AQ12","v":0},{"$f":"Masthähnchen!BA12","v":0},{"$f":"Masthähnchen!Z12","v":0},{"$f":"Masthähnchen!AC12","v":0},{"$f":"Masthähnchen!AF12","v":0},{"$f":"Masthähnchen!AH12","v":0},0,{"$f":"Masthähnchen!E12","v":0},580,0]
[{"$f":"Masthähnchen!A13","v":0},{"$f":"Masthähnchen!L13","v":0},{"$f":"Masthähnchen!P13","v":0},{"$f":"Masthähnchen!W13","v":0},{"$f":"Masthähnchen!AQ13","v":0},{"$f":"Masthähnchen!BA13","v":0},{"$f":"Masthähnchen!Z13","v":0},{"$f":"Masthähnchen!AC13","v":0},{"$f":"Masthähnchen!AF13","v":0},{"$f":"Masthähnchen!AH13","v":0},0,{"$f":"Masthähnchen!E13","v":0},580,0]
[{"$f":"Masthähnchen!A14","v":"Bewegl. Ställe"}]
[{"$f":"Masthähnchen!A15","v":0},{"$f":"Masthähnchen!L15","v":0},{"$f":"Masthähnchen!P15","v":0},{"$f":"Masthähnchen!W15","v":0},{"$f":"Masthähnchen!AQ15","v":0},{"$f":"Masthähnchen!BA15","v":0},{"$f":"Masthähnchen!Z15","v":0},{"$f":"Masthähnchen!AC15","v":0},{"$f":"Masthähnchen!AF15","v":0},{"$f":"Masthähnchen!AH15","v":0},{"$f":"IF(SUM(B250:J250)=0,0,MIN(B250:J250))","v":0},{"$f":"Masthähnchen!E15","v":0},580,{"$f":"L250/M250*$L$2","v":0}]
[{"$f":"Masthähnchen!A16","v":0},{"$f":"Masthähnchen!L16","v":0},{"$f":"Masthähnchen!P16","v":0},{"$f":"Masthähnchen!W16","v":0},{"$f":"Masthähnchen!AQ16","v":0},{"$f":"Masthähnchen!BA16","v":0},{"$f":"Masthähnchen!Z16","v":0},{"$f":"Masthähnchen!AC16","v":0},{"$f":"Masthähnchen!AF16","v":0},{"$f":"Masthähnchen!AH16","v":0},0,{"$f":"Masthähnchen!E16","v":0},580,0]
[{"$f":"Masthähnchen!A17","v":0},{"$f":"Masthähnchen!L17","v":0},{"$f":"Masthähnchen!P17","v":0},{"$f":"Masthähnchen!W17","v":0},{"$f":"Masthähnchen!AQ17","v":0},{"$f":"Masthähnchen!BA17","v":0},{"$f":"Masthähnchen!Z17","v":0},{"$f":"Masthähnchen!AC17","v":0},{"$f":"Masthähnchen!AF17","v":0},{"$f":"Masthähnchen!AH17","v":0},0,{"$f":"Masthähnchen!E17","v":0},580,0]
[{"$f":"Masthähnchen!A18","v":0},{"$f":"Masthähnchen!L18","v":0},{"$f":"Masthähnchen!P18","v":0},{"$f":"Masthähnchen!W18","v":0},{"$f":"Masthähnchen!AQ18","v":0},{"$f":"Masthähnchen!BA18","v":0},{"$f":"Masthähnchen!Z18","v":0},{"$f":"Masthähnchen!AC18","v":0},{"$f":"Masthähnchen!AF18","v":0},{"$f":"Masthähnchen!AH18","v":0},0,{"$f":"Masthähnchen!E18","v":0},580,0]
[{"$f":"Masthähnchen!A19","v":0},{"$f":"Masthähnchen!L19","v":0},{"$f":"Masthähnchen!P19","v":0},{"$f":"Masthähnchen!W19","v":0},{"$f":"Masthähnchen!AQ19","v":0},{"$f":"Masthähnchen!BA19","v":0},{"$f":"Masthähnchen!Z19","v":0},{"$f":"Masthähnchen!AC19","v":0},{"$f":"Masthähnchen!AF19","v":0},{"$f":"Masthähnchen!AH19","v":0},0,{"$f":"Masthähnchen!E19","v":0},580,0]
[{"$f":"Masthähnchen!A20","v":0},{"$f":"Masthähnchen!L20","v":0},{"$f":"Masthähnchen!P20","v":0},{"$f":"Masthähnchen!W20","v":0},{"$f":"Masthähnchen!AQ20","v":0},{"$f":"Masthähnchen!BA20","v":0},{"$f":"Masthähnchen!Z20","v":0},{"$f":"Masthähnchen!AC20","v":0},{"$f":"Masthähnchen!AF20","v":0},{"$f":"Masthähnchen!AH20","v":0},0,{"$f":"Masthähnchen!E20","v":0},580,0]
[{"$f":"Masthähnchen!A21","v":0},{"$f":"Masthähnchen!L21","v":0},{"$f":"Masthähnchen!P21","v":0},{"$f":"Masthähnchen!W21","v":0},{"$f":"Masthähnchen!AQ21","v":0},{"$f":"Masthähnchen!BA21","v":0},{"$f":"Masthähnchen!Z21","v":0},{"$f":"Masthähnchen!AC21","v":0},{"$f":"Masthähnchen!AF21","v":0},{"$f":"Masthähnchen!AH21","v":0},0,{"$f":"Masthähnchen!E21","v":0},580,0]
[{"$f":"Masthähnchen!A22","v":0},{"$f":"Masthähnchen!L22","v":0},{"$f":"Masthähnchen!P22","v":0},{"$f":"Masthähnchen!W22","v":0},{"$f":"Masthähnchen!AQ22","v":0},{"$f":"Masthähnchen!BA22","v":0},{"$f":"Masthähnchen!Z22","v":0},{"$f":"Masthähnchen!AC22","v":0},{"$f":"Masthähnchen!AF22","v":0},{"$f":"Masthähnchen!AH22","v":0},0,{"$f":"Masthähnchen!E22","v":0},580,0]
[]
[]
[{"$f":"Masthähnchen!A25","v":"Kapaune"}]
[{"$f":"Masthähnchen!A26","v":0},{"$f":"Masthähnchen!L26","v":0},{"$f":"Masthähnchen!P26","v":0},{"$f":"Masthähnchen!W26","v":0},{"$f":"Masthähnchen!AQ26","v":0},{"$f":"Masthähnchen!BA26","v":0},{"$f":"Masthähnchen!Z26","v":0},{"$f":"Masthähnchen!AC26","v":0},{"$f":"Masthähnchen!AF26","v":0},{"$f":"Masthähnchen!AH26","v":0},{"$f":"IF(SUM(B261:J261)=0,0,MIN(B261:J261))","v":0},{"$f":"Masthähnchen!E26","v":0},580,0]
[{"$f":"Masthähnchen!A27","v":0},{"$f":"Masthähnchen!L27","v":0},{"$f":"Masthähnchen!P27","v":0},{"$f":"Masthähnchen!W27","v":0},{"$f":"Masthähnchen!AQ27","v":0},{"$f":"Masthähnchen!BA27","v":0},{"$f":"Masthähnchen!Z27","v":0},{"$f":"Masthähnchen!AC27","v":0},{"$f":"Masthähnchen!AF27","v":0},{"$f":"Masthähnchen!AH27","v":0},0,{"$f":"Masthähnchen!E27","v":0},580,0]
[{"$f":"Masthähnchen!A28","v":0},{"$f":"Masthähnchen!L28","v":0},{"$f":"Masthähnchen!P28","v":0},{"$f":"Masthähnchen!W28","v":0},{"$f":"Masthähnchen!AQ28","v":0},{"$f":"Masthähnchen!BA28","v":0},{"$f":"Masthähnchen!Z28","v":0},{"$f":"Masthähnchen!AC28","v":0},{"$f":"Masthähnchen!AF28","v":0},{"$f":"Masthähnchen!AH28","v":0},0,{"$f":"Masthähnchen!E28","v":0},580,0]
[{"$f":"Masthähnchen!A29","v":0},{"$f":"Masthähnchen!L29","v":0},{"$f":"Masthähnchen!P29","v":0},{"$f":"Masthähnchen!W29","v":0},{"$f":"Masthähnchen!AQ29","v":0},{"$f":"Masthähnchen!BA29","v":0},{"$f":"Masthähnchen!Z29","v":0},{"$f":"Masthähnchen!AC29","v":0},{"$f":"Masthähnchen!AF29","v":0},{"$f":"Masthähnchen!AH29","v":0},0,{"$f":"Masthähnchen!E29","v":0},580,0]
[{"$f":"Masthähnchen!A30","v":0},{"$f":"Masthähnchen!L30","v":0},{"$f":"Masthähnchen!P30","v":0},{"$f":"Masthähnchen!W30","v":0},{"$f":"Masthähnchen!AQ30","v":0},{"$f":"Masthähnchen!BA30","v":0},{"$f":"Masthähnchen!Z30","v":0},{"$f":"Masthähnchen!AC30","v":0},{"$f":"Masthähnchen!AF30","v":0},{"$f":"Masthähnchen!AH30","v":0},0,{"$f":"Masthähnchen!E30","v":0},580,0]
[{"$f":"Masthähnchen!A31","v":0},{"$f":"Masthähnchen!L31","v":0},{"$f":"Masthähnchen!P31","v":0},{"$f":"Masthähnchen!W31","v":0},{"$f":"Masthähnchen!AQ31","v":0},{"$f":"Masthähnchen!BA31","v":0},{"$f":"Masthähnchen!Z31","v":0},{"$f":"Masthähnchen!AC31","v":0},{"$f":"Masthähnchen!AF31","v":0},{"$f":"Masthähnchen!AH31","v":0},0,{"$f":"Masthähnchen!E31","v":0},580,0]
[{"$f":"Masthähnchen!A32","v":0},{"$f":"Masthähnchen!L32","v":0},{"$f":"Masthähnchen!P32","v":0},{"$f":"Masthähnchen!W32","v":0},{"$f":"Masthähnchen!AQ32","v":0},{"$f":"Masthähnchen!BA32","v":0},{"$f":"Masthähnchen!Z32","v":0},{"$f":"Masthähnchen!AC32","v":0},{"$f":"Masthähnchen!AF32","v":0},{"$f":"Masthähnchen!AH32","v":0},0,{"$f":"Masthähnchen!E32","v":0},580,0]
[{"$f":"Masthähnchen!A33","v":0},{"$f":"Masthähnchen!L33","v":0},{"$f":"Masthähnchen!P33","v":0},{"$f":"Masthähnchen!W33","v":0},{"$f":"Masthähnchen!AQ33","v":0},{"$f":"Masthähnchen!BA33","v":0},{"$f":"Masthähnchen!Z33","v":0},{"$f":"Masthähnchen!AC33","v":0},{"$f":"Masthähnchen!AF33","v":0},{"$f":"Masthähnchen!AH33","v":0},0,{"$f":"Masthähnchen!E33","v":0},580,0]
[]
[]
[{"$f":"Masthähnchen!A36","v":"Poularden"}]
[{"$f":"Masthähnchen!A37","v":0},{"$f":"Masthähnchen!L37","v":0},{"$f":"Masthähnchen!P37","v":0},{"$f":"Masthähnchen!W37","v":0},{"$f":"Masthähnchen!AQ37","v":0},{"$f":"Masthähnchen!BA37","v":0},{"$f":"Masthähnchen!Z37","v":0},{"$f":"Masthähnchen!AC37","v":0},{"$f":"Masthähnchen!AF37","v":0},{"$f":"Masthähnchen!AH37","v":0},{"$f":"IF(SUM(B272:J272)=0,0,MIN(B272:J272))","v":0},{"$f":"Masthähnchen!E37","v":0},580,0]
[{"$f":"Masthähnchen!A38","v":0},{"$f":"Masthähnchen!L38","v":0},{"$f":"Masthähnchen!P38","v":0},{"$f":"Masthähnchen!W38","v":0},{"$f":"Masthähnchen!AQ38","v":0},{"$f":"Masthähnchen!BA38","v":0},{"$f":"Masthähnchen!Z38","v":0},{"$f":"Masthähnchen!AC38","v":0},{"$f":"Masthähnchen!AF38","v":0},{"$f":"Masthähnchen!AH38","v":0},0,{"$f":"Masthähnchen!E38","v":0},580,0]
[{"$f":"Masthähnchen!A39","v":0},{"$f":"Masthähnchen!L39","v":0},{"$f":"Masthähnchen!P39","v":0},{"$f":"Masthähnchen!W39","v":0},{"$f":"Masthähnchen!AQ39","v":0},{"$f":"Masthähnchen!BA39","v":0},{"$f":"Masthähnchen!Z39","v":0},{"$f":"Masthähnchen!AC39","v":0},{"$f":"Masthähnchen!AF39","v":0},{"$f":"Masthähnchen!AH39","v":0},0,{"$f":"Masthähnchen!E39","v":0},580,0]
[{"$f":"Masthähnchen!A40","v":0},{"$f":"Masthähnchen!L40","v":0},{"$f":"Masthähnchen!P40","v":0},{"$f":"Masthähnchen!W40","v":0},{"$f":"Masthähnchen!AQ40","v":0},{"$f":"Masthähnchen!BA40","v":0},{"$f":"Masthähnchen!Z40","v":0},{"$f":"Masthähnchen!AC40","v":0},{"$f":"Masthähnchen!AF40","v":0},{"$f":"Masthähnchen!AH40","v":0},0,{"$f":"Masthähnchen!E40","v":0},580,0]
[{"$f":"Masthähnchen!A41","v":0},{"$f":"Masthähnchen!L41","v":0},{"$f":"Masthähnchen!P41","v":0},{"$f":"Masthähnchen!W41","v":0},{"$f":"Masthähnchen!AQ41","v":0},{"$f":"Masthähnchen!BA41","v":0},{"$f":"Masthähnchen!Z41","v":0},{"$f":"Masthähnchen!AC41","v":0},{"$f":"Masthähnchen!AF41","v":0},{"$f":"Masthähnchen!AH41","v":0},0,{"$f":"Masthähnchen!E41","v":0},580,0]
[{"$f":"Masthähnchen!A42","v":0},{"$f":"Masthähnchen!L42","v":0},{"$f":"Masthähnchen!P42","v":0},{"$f":"Masthähnchen!W42","v":0},{"$f":"Masthähnchen!AQ42","v":0},{"$f":"Masthähnchen!BA42","v":0},{"$f":"Masthähnchen!Z42","v":0},{"$f":"Masthähnchen!AC42","v":0},{"$f":"Masthähnchen!AF42","v":0},{"$f":"Masthähnchen!AH42","v":0},0,{"$f":"Masthähnchen!E42","v":0},580,0]
[{"$f":"Masthähnchen!A43","v":0},{"$f":"Masthähnchen!L43","v":0},{"$f":"Masthähnchen!P43","v":0},{"$f":"Masthähnchen!W43","v":0},{"$f":"Masthähnchen!AQ43","v":0},{"$f":"Masthähnchen!BA43","v":0},{"$f":"Masthähnchen!Z43","v":0},{"$f":"Masthähnchen!AC43","v":0},{"$f":"Masthähnchen!AF43","v":0},{"$f":"Masthähnchen!AH43","v":0},0,{"$f":"Masthähnchen!E43","v":0},580,0]
[{"$f":"Masthähnchen!A44","v":0},{"$f":"Masthähnchen!L44","v":0},{"$f":"Masthähnchen!P44","v":0},{"$f":"Masthähnchen!W44","v":0},{"$f":"Masthähnchen!AQ44","v":0},{"$f":"Masthähnchen!BA44","v":0},{"$f":"Masthähnchen!Z44","v":0},{"$f":"Masthähnchen!AC44","v":0},{"$f":"Masthähnchen!AF44","v":0},{"$f":"Masthähnchen!AH44","v":0},0,{"$f":"Masthähnchen!E44","v":0},580,{"$f":"L279/M279*$L$2","v":0}]
[null,null,null,null,null,null,null,null,null,null,null,null,{"$f":"CONCATENATE(\"Gesamt \",A239)","v":"Gesamt Mastgeflügel"},{"$f":"SUM(N241:N279)","v":0}]
[]
["Mastputen"]
["Stall","Ebenen","Tiere Stall","Sitzgelegenht.","Futtertöge","Tränken","Luken \n(Stall-KSR)","Scharraum","Auslauföffnungen","Auslauf","Max. Tierzahl","Gehaltene Tiere","Tiere max. / ha","Kg N max."]
[{"$f":"Mastputen!A6","v":0},{"$f":"Mastputen!L6","v":0},{"$f":"Mastputen!P6","v":0},null,{"$f":"Mastputen!AQ6","v":0},{"$f":"Mastputen!BA6","v":0},{"$f":"Mastputen!Z6","v":0},{"$f":"Mastputen!AC6","v":0},{"$f":"Mastputen!AF6","v":0},{"$f":"Mastputen!AH6","v":0},{"$f":"IF(SUM(B284:J284)=0,0,MIN(B284:J284))","v":0},{"$f":"Mastputen!E6","v":0},212,{"$f":"L284/M284*$L$2","v":0}]
[{"$f":"Mastputen!A7","v":0},{"$f":"Mastputen!L7","v":0},{"$f":"Mastputen!P7","v":0},null,{"$f":"Mastputen!AQ7","v":0},{"$f":"Mastputen!BA7","v":0},{"$f":"Mastputen!Z7","v":0},{"$f":"Mastputen!AC7","v":0},{"$f":"Mastputen!AF7","v":0},{"$f":"Mastputen!AH7","v":0},0,{"$f":"Mastputen!E7","v":0},212,0]
[{"$f":"Mastputen!A8","v":0},{"$f":"Mastputen!L8","v":0},{"$f":"Mastputen!P8","v":0},null,{"$f":"Mastputen!AQ8","v":0},{"$f":"Mastputen!BA8","v":0},{"$f":"Mastputen!Z8","v":0},{"$f":"Mastputen!AC8","v":0},{"$f":"Mastputen!AF8","v":0},{"$f":"Mastputen!AH8","v":0},0,{"$f":"Mastputen!E8","v":0},212,0]
[{"$f":"Mastputen!A9","v":0},{"$f":"Mastputen!L9","v":0},{"$f":"Mastputen!P9","v":0},null,{"$f":"Mastputen!AQ9","v":0},{"$f":"Mastputen!BA9","v":0},{"$f":"Mastputen!Z9","v":0},{"$f":"Mastputen!AC9","v":0},{"$f":"Mastputen!AF9","v":0},{"$f":"Mastputen!AH9","v":0},0,{"$f":"Mastputen!E9","v":0},212,0]
[{"$f":"Mastputen!A10","v":0},{"$f":"Mastputen!L10","v":0},{"$f":"Mastputen!P10","v":0},null,{"$f":"Mastputen!AQ10","v":0},{"$f":"Mastputen!BA10","v":0},{"$f":"Mastputen!Z10","v":0},{"$f":"Mastputen!AC10","v":0},{"$f":"Mastputen!AF10","v":0},{"$f":"Mastputen!AH10","v":0},0,{"$f":"Mastputen!E10","v":0},212,0]
[{"$f":"Mastputen!A11","v":0},{"$f":"Mastputen!L11","v":0},{"$f":"Mastputen!P11","v":0},null,{"$f":"Mastputen!AQ11","v":0},{"$f":"Mastputen!BA11","v":0},{"$f":"Mastputen!Z11","v":0},{"$f":"Mastputen!AC11","v":0},{"$f":"Mastputen!AF11","v":0},{"$f":"Mastputen!AH11","v":0},0,{"$f":"Mastputen!E11","v":0},212,0]
[{"$f":"Mastputen!A12","v":0},{"$f":"Mastputen!L12","v":0},{"$f":"Mastputen!P12","v":0},null,{"$f":"Mastputen!AQ12","v":0},{"$f":"Mastputen!BA12","v":0},{"$f":"Mastputen!Z12","v":0},{"$f":"Mastputen!AC12","v":0},{"$f":"Mastputen!AF12","v":0},{"$f":"Mastputen!AH12","v":0},0,{"$f":"Mastputen!E12","v":0},212,0]
[{"$f":"Mastputen!A13","v":0},{"$f":"Mastputen!L13","v":0},{"$f":"Mastputen!P13","v":0},null,{"$f":"Mastputen!AQ13","v":0},{"$f":"Mastputen!BA13","v":0},{"$f":"Mastputen!Z13","v":0},{"$f":"Mastputen!AC13","v":0},{"$f":"Mastputen!AF13","v":0},{"$f":"Mastputen!AH13","v":0},0,{"$f":"Mastputen!E13","v":0},212,0]
[{"$f":"Mastputen!A14","v":"Bewegl. Ställe"}]
[{"$f":"Mastputen!A15","v":0},{"$f":"Mastputen!L15","v":0},{"$f":"Mastputen!P15","v":0},null,{"$f":"Mastputen!AQ15","v":0},{"$f":"Mastputen!BA15","v":0},{"$f":"Mastputen!Z15","v":0},{"$f":"Mastputen!AC15","v":0},{"$f":"Mastputen!AF15","v":0},{"$f":"Mastputen!AH15","v":0},{"$f":"IF(SUM(B293:J293)=0,0,MIN(B293:J293))","v":0},{"$f":"Mastputen!E15","v":0},212,{"$f":"L293/M293*$L$2","v":0}]
[{"$f":"Mastputen!A16","v":0},{"$f":"Mastputen!L16","v":0},{"$f":"Mastputen!P16","v":0},null,{"$f":"Mastputen!AQ16","v":0},{"$f":"Mastputen!BA16","v":0},{"$f":"Mastputen!Z16","v":0},{"$f":"Mastputen!AC16","v":0},{"$f":"Mastputen!AF16","v":0},{"$f":"Mastputen!AH16","v":0},0,{"$f":"Mastputen!E16","v":0},212,0]
[{"$f":"Mastputen!A17","v":0},{"$f":"Mastputen!L17","v":0},{"$f":"Mastputen!P17","v":0},null,{"$f":"Mastputen!AQ17","v":0},{"$f":"Mastputen!BA17","v":0},{"$f":"Mastputen!Z17","v":0},{"$f":"Mastputen!AC17","v":0},{"$f":"Mastputen!AF17","v":0},{"$f":"Mastputen!AH17","v":0},0,{"$f":"Mastputen!E17","v":0},212,0]
[{"$f":"Mastputen!A18","v":0},{"$f":"Mastputen!L18","v":0},{"$f":"Mastputen!P18","v":0},null,{"$f":"Mastputen!AQ18","v":0},{"$f":"Mastputen!BA18","v":0},{"$f":"Mastputen!Z18","v":0},{"$f":"Mastputen!AC18","v":0},{"$f":"Mastputen!AF18","v":0},{"$f":"Mastputen!AH18","v":0},0,{"$f":"Mastputen!E18","v":0},212,0]
[{"$f":"Mastputen!A19","v":0},{"$f":"Mastputen!L19","v":0},{"$f":"Mastputen!P19","v":0},null,{"$f":"Mastputen!AQ19","v":0},{"$f":"Mastputen!BA19","v":0},{"$f":"Mastputen!Z19","v":0},{"$f":"Mastputen!AC19","v":0},{"$f":"Mastputen!AF19","v":0},{"$f":"Mastputen!AH19","v":0},0,{"$f":"Mastputen!E19","v":0},212,0]
[{"$f":"Mastputen!A20","v":0},{"$f":"Mastputen!L20","v":0},{"$f":"Mastputen!P20","v":0},null,{"$f":"Mastputen!AQ20","v":0},{"$f":"Mastputen!BA20","v":0},{"$f":"Mastputen!Z20","v":0},{"$f":"Mastputen!AC20","v":0},{"$f":"Mastputen!AF20","v":0},{"$f":"Mastputen!AH20","v":0},0,{"$f":"Mastputen!E20","v":0},212,0]
[{"$f":"Mastputen!A21","v":0},{"$f":"Mastputen!L21","v":0},{"$f":"Mastputen!P21","v":0},null,{"$f":"Mastputen!AQ21","v":0},{"$f":"Mastputen!BA21","v":0},{"$f":"Mastputen!Z21","v":0},{"$f":"Mastputen!AC21","v":0},{"$f":"Mastputen!AF21","v":0},{"$f":"Mastputen!AH21","v":0},0,{"$f":"Mastputen!E21","v":0},212,0]
[{"$f":"Mastputen!A22","v":0},{"$f":"Mastputen!L22","v":0},{"$f":"Mastputen!P22","v":0},null,{"$f":"Mastputen!AQ22","v":0},{"$f":"Mastputen!BA22","v":0},{"$f":"Mastputen!Z22","v":0},{"$f":"Mastputen!AC22","v":0},{"$f":"Mastputen!AF22","v":0},{"$f":"Mastputen!AH22","v":0},0,{"$f":"Mastputen!E22","v":0},212,0]
[{"$f":"Mastputen!A23","v":0},{"$f":"Mastputen!L23","v":0},{"$f":"Mastputen!P23","v":0},null,{"$f":"Mastputen!AQ23","v":0},{"$f":"Mastputen!BA23","v":0},{"$f":"Mastputen!Z23","v":0},{"$f":"Mastputen!AC23","v":0},{"$f":"Mastputen!AF23","v":0},{"$f":"Mastputen!AH23","v":0},0,{"$f":"Mastputen!E23","v":0},212,0]
[null,null,null,null,null,null,null,null,null,null,null,null,{"$f":"CONCATENATE(\"Gesamt \",A282)","v":"Gesamt Mastputen"},{"$f":"SUM(N284:N301)","v":0}]
[]
["Mastgeflügel sonst."]
["Stall","Ebenen","Tiere Stall","Sitzgelegenht.","Futtertöge","Tränken","Luken \n(Stall-KSR)","Scharraum","Auslauföffnungen","Auslauf","Max. Tierzahl","Gehaltene Tiere","Tiere max. / ha","Kg N max."]
[{"$f":"Mastgeflügel!A5","v":"Gänse"}]
[{"$f":"Mastgeflügel!A6","v":0},{"$f":"Mastgeflügel!L6","v":0},{"$f":"Mastgeflügel!P6","v":0},null,{"$f":"Mastgeflügel!AQ6","v":0},{"$f":"Mastgeflügel!BA6","v":0},{"$f":"Mastgeflügel!Z6","v":0},{"$f":"Mastgeflügel!AC6","v":0},{"$f":"Mastgeflügel!AF6","v":0},{"$f":"Mastgeflügel!AH6","v":0},{"$f":"IF(SUM(B307:J307)=0,0,MIN(B307:J307))","v":0},{"$f":"Mastgeflügel!E6","v":0},{"$f":"280/1.4*$R$2","v":425},{"$f":"L307/M307*$L$2","v":0}]
[{"$f":"Mastgeflügel!A7","v":0},{"$f":"Mastgeflügel!L7","v":0},{"$f":"Mastgeflügel!P7","v":0},null,{"$f":"Mastgeflügel!AQ7","v":0},{"$f":"Mastgeflügel!BA7","v":0},{"$f":"Mastgeflügel!Z7","v":0},{"$f":"Mastgeflügel!AC7","v":0},{"$f":"Mastgeflügel!AF7","v":0},{"$f":"Mastgeflügel!AH7","v":0},{"$f":"IF(SUM(B308:J308)=0,0,MIN(B308:J308))","v":0},{"$f":"Mastgeflügel!E7","v":0},{"$f":"280/1.4*$R$2","v":425},{"$f":"L308/M308*$L$2","v":0}]
[{"$f":"Mastgeflügel!A8","v":0},{"$f":"Mastgeflügel!L8","v":0},{"$f":"Mastgeflügel!P8","v":0},null,{"$f":"Mastgeflügel!AQ8","v":0},{"$f":"Mastgeflügel!BA8","v":0},{"$f":"Mastgeflügel!Z8","v":0},{"$f":"Mastgeflügel!AC8","v":0},{"$f":"Mastgeflügel!AF8","v":0},{"$f":"Mastgeflügel!AH8","v":0},{"$f":"IF(SUM(B309:J309)=0,0,MIN(B309:J309))","v":0},{"$f":"Mastgeflügel!E8","v":0},{"$f":"280/1.4*$R$2","v":425},{"$f":"L309/M309*$L$2","v":0}]
[{"$f":"Mastgeflügel!A9","v":0},{"$f":"Mastgeflügel!L9","v":0},{"$f":"Mastgeflügel!P9","v":0},null,{"$f":"Mastgeflügel!AQ9","v":0},{"$f":"Mastgeflügel!BA9","v":0},{"$f":"Mastgeflügel!Z9","v":0},{"$f":"Mastgeflügel!AC9","v":0},{"$f":"Mastgeflügel!AF9","v":0},{"$f":"Mastgeflügel!AH9","v":0},{"$f":"IF(SUM(B310:J310)=0,0,MIN(B310:J310))","v":0},{"$f":"Mastgeflügel!E9","v":0},{"$f":"280/1.4*$R$2","v":425},{"$f":"L310/M310*$L$2","v":0}]
[{"$f":"Mastgeflügel!A10","v":"Enten wbl."},null,null,null,null,null,null,null,null,null,null,null,{"$f":"CONCATENATE(\"Gesamt \",A306)","v":"Gesamt Gänse"},{"$f":"SUM(N307:N310)","v":0}]
[{"$f":"Mastgeflügel!A11","v":0},{"$f":"Mastgeflügel!L11","v":0},{"$f":"Mastgeflügel!P11","v":0},null,{"$f":"Mastgeflügel!AQ11","v":0},{"$f":"Mastgeflügel!BA11","v":0},{"$f":"Mastgeflügel!Z11","v":0},{"$f":"Mastgeflügel!AC11","v":0},{"$f":"Mastgeflügel!AF11","v":0},{"$f":"Mastgeflügel!AH11","v":0},{"$f":"IF(SUM(B312:J312)=0,0,MIN(B312:J312))","v":0},{"$f":"Mastgeflügel!E11","v":0},{"$f":"210/1.4*$R$2","v":318.75},{"$f":"L312/M312*$L$2","v":0}]
[{"$f":"Mastgeflügel!A12","v":0},{"$f":"Mastgeflügel!L12","v":0},{"$f":"Mastgeflügel!P12","v":0},null,{"$f":"Mastgeflügel!AQ12","v":0},{"$f":"Mastgeflügel!BA12","v":0},{"$f":"Mastgeflügel!Z12","v":0},{"$f":"Mastgeflügel!AC12","v":0},{"$f":"Mastgeflügel!AF12","v":0},{"$f":"Mastgeflügel!AH12","v":0},{"$f":"IF(SUM(B313:J313)=0,0,MIN(B313:J313))","v":0},{"$f":"Mastgeflügel!E12","v":0},{"$f":"210/1.4*$R$2","v":318.75},{"$f":"L313/M313*$L$2","v":0}]
[{"$f":"Mastgeflügel!A13","v":0},{"$f":"Mastgeflügel!L13","v":0},{"$f":"Mastgeflügel!P13","v":0},null,{"$f":"Mastgeflügel!AQ13","v":0},{"$f":"Mastgeflügel!BA13","v":0},{"$f":"Mastgeflügel!Z13","v":0},{"$f":"Mastgeflügel!AC13","v":0},{"$f":"Mastgeflügel!AF13","v":0},{"$f":"Mastgeflügel!AH13","v":0},{"$f":"IF(SUM(B314:J314)=0,0,MIN(B314:J314))","v":0},{"$f":"Mastgeflügel!E13","v":0},{"$f":"210/1.4*$R$2","v":318.75},{"$f":"L314/M314*$L$2","v":0}]
[{"$f":"Mastgeflügel!A14","v":0},{"$f":"Mastgeflügel!L14","v":0},{"$f":"Mastgeflügel!P14","v":0},null,{"$f":"Mastgeflügel!AQ14","v":0},{"$f":"Mastgeflügel!BA14","v":0},{"$f":"Mastgeflügel!Z14","v":0},{"$f":"Mastgeflügel!AC14","v":0},{"$f":"Mastgeflügel!AF14","v":0},{"$f":"Mastgeflügel!AH14","v":0},{"$f":"IF(SUM(B315:J315)=0,0,MIN(B315:J315))","v":0},{"$f":"Mastgeflügel!E14","v":0},{"$f":"210/1.4*$R$2","v":318.75},{"$f":"L315/M315*$L$2","v":0}]
[{"$f":"Mastgeflügel!A15","v":"Enten männl."},null,null,null,null,null,null,null,null,null,null,null,{"$f":"CONCATENATE(\"Gesamt \",A311)","v":"Gesamt Enten wbl."},{"$f":"SUM(N312:N315)","v":0}]
[{"$f":"Mastgeflügel!A16","v":0},{"$f":"Mastgeflügel!L16","v":0},{"$f":"Mastgeflügel!P16","v":0},null,{"$f":"Mastgeflügel!AQ16","v":0},{"$f":"Mastgeflügel!BA16","v":0},{"$f":"Mastgeflügel!Z16","v":0},{"$f":"Mastgeflügel!AC16","v":0},{"$f":"Mastgeflügel!AF16","v":0},{"$f":"Mastgeflügel!AH16","v":0},{"$f":"IF(SUM(B317:J317)=0,0,MIN(B317:J317))","v":0},{"$f":"Mastgeflügel!E16","v":0},{"$f":"210/1.4*$R$2","v":318.75},{"$f":"L317/M317*$L$2","v":0}]
[{"$f":"Mastgeflügel!A17","v":0},{"$f":"Mastgeflügel!L17","v":0},{"$f":"Mastgeflügel!P17","v":0},null,{"$f":"Mastgeflügel!AQ17","v":0},{"$f":"Mastgeflügel!BA17","v":0},{"$f":"Mastgeflügel!Z17","v":0},{"$f":"Mastgeflügel!AC17","v":0},{"$f":"Mastgeflügel!AF17","v":0},{"$f":"Mastgeflügel!AH17","v":0},{"$f":"IF(SUM(B318:J318)=0,0,MIN(B318:J318))","v":0},{"$f":"Mastgeflügel!E17","v":0},{"$f":"210/1.4*$R$2","v":318.75},{"$f":"L318/M318*$L$2","v":0}]
[{"$f":"Mastgeflügel!A18","v":0},{"$f":"Mastgeflügel!L18","v":0},{"$f":"Mastgeflügel!P18","v":0},null,{"$f":"Mastgeflügel!AQ18","v":0},{"$f":"Mastgeflügel!BA18","v":0},{"$f":"Mastgeflügel!Z18","v":0},{"$f":"Mastgeflügel!AC18","v":0},{"$f":"Mastgeflügel!AF18","v":0},{"$f":"Mastgeflügel!AH18","v":0},{"$f":"IF(SUM(B319:J319)=0,0,MIN(B319:J319))","v":0},{"$f":"Mastgeflügel!E18","v":0},{"$f":"210/1.4*$R$2","v":318.75},{"$f":"L319/M319*$L$2","v":0}]
[{"$f":"Mastgeflügel!A19","v":0},{"$f":"Mastgeflügel!L19","v":0},{"$f":"Mastgeflügel!P19","v":0},null,{"$f":"Mastgeflügel!AQ19","v":0},{"$f":"Mastgeflügel!BA19","v":0},{"$f":"Mastgeflügel!Z19","v":0},{"$f":"Mastgeflügel!AC19","v":0},{"$f":"Mastgeflügel!AF19","v":0},{"$f":"Mastgeflügel!AH19","v":0},{"$f":"IF(SUM(B320:J320)=0,0,MIN(B320:J320))","v":0},{"$f":"Mastgeflügel!E19","v":0},{"$f":"210/1.4*$R$2","v":318.75},{"$f":"L320/M320*$L$2","v":0}]
[{"$f":"Mastgeflügel!A20","v":"Perl-hühner"},null,null,null,null,null,null,null,null,null,null,null,{"$f":"CONCATENATE(\"Gesamt \",A316)","v":"Gesamt Enten männl."},{"$f":"SUM(N317:N320)","v":0}]
[{"$f":"Mastgeflügel!A21","v":0},{"$f":"Mastgeflügel!L21","v":0},{"$f":"Mastgeflügel!P21","v":0},{"$f":"Mastgeflügel!S21","v":0},{"$f":"Mastgeflügel!AQ21","v":0},{"$f":"Mastgeflügel!BA21","v":0},{"$f":"Mastgeflügel!Z21","v":0},{"$f":"Mastgeflügel!AC21","v":0},{"$f":"Mastgeflügel!AF21","v":0},{"$f":"Mastgeflügel!AH21","v":0},{"$f":"IF(SUM(B322:J322)=0,0,MIN(B322:J322))","v":0},{"$f":"Mastgeflügel!E21","v":0},580,{"$f":"L322/M322*$L$2","v":0}]
[{"$f":"Mastgeflügel!A22","v":0},{"$f":"Mastgeflügel!L22","v":0},{"$f":"Mastgeflügel!P22","v":0},{"$f":"Mastgeflügel!S22","v":0},{"$f":"Mastgeflügel!AQ22","v":0},{"$f":"Mastgeflügel!BA22","v":0},{"$f":"Mastgeflügel!Z22","v":0},{"$f":"Mastgeflügel!AC22","v":0},{"$f":"Mastgeflügel!AF22","v":0},{"$f":"Mastgeflügel!AH22","v":0},{"$f":"IF(SUM(B323:J323)=0,0,MIN(B323:J323))","v":0},{"$f":"Mastgeflügel!E22","v":0},580,{"$f":"L323/M323*$L$2","v":0}]
[{"$f":"Mastgeflügel!A23","v":0},{"$f":"Mastgeflügel!L23","v":0},{"$f":"Mastgeflügel!P23","v":0},{"$f":"Mastgeflügel!S23","v":0},{"$f":"Mastgeflügel!AQ23","v":0},{"$f":"Mastgeflügel!BA23","v":0},{"$f":"Mastgeflügel!Z23","v":0},{"$f":"Mastgeflügel!AC23","v":0},{"$f":"Mastgeflügel!AF23","v":0},{"$f":"Mastgeflügel!AH23","v":0},{"$f":"IF(SUM(B324:J324)=0,0,MIN(B324:J324))","v":0},{"$f":"Mastgeflügel!E23","v":0},580,{"$f":"L324/M324*$L$2","v":0}]
[{"$f":"Mastgeflügel!A24","v":0},{"$f":"Mastgeflügel!L24","v":0},{"$f":"Mastgeflügel!P24","v":0},{"$f":"Mastgeflügel!S24","v":0},{"$f":"Mastgeflügel!AQ24","v":0},{"$f":"Mastgeflügel!BA24","v":0},{"$f":"Mastgeflügel!Z24","v":0},{"$f":"Mastgeflügel!AC24","v":0},{"$f":"Mastgeflügel!AF24","v":0},{"$f":"Mastgeflügel!AH24","v":0},{"$f":"IF(SUM(B325:J325)=0,0,MIN(B325:J325))","v":0},{"$f":"Mastgeflügel!E24","v":0},580,{"$f":"L325/M325*$L$2","v":0}]
[null,null,null,null,null,null,null,null,null,null,null,null,{"$f":"CONCATENATE(\"Gesamt \",A321)","v":"Gesamt Perl-hühner"},{"$f":"SUM(N322:N325)","v":0}]

{"sheet":"Dropdown","index":14,"n_rows":8,"n_cols":7,"rows_kept":8,"cut":false,"hidden":true,"merged":[]}
["Status",null,"Zucht",null,"Einheit",null,"Tierart"]
["Ökologisch",null,"Natursprung",null,"dt",null,"Rinder"]
["In Umstellung",null,"Künstliche Besamung",null,"m3",null,"Pferde, Kl. Widerkäuer"]
["1. Umstellungsjahr- Nicht ökologisch",null,null,null,"Rundballen",null,"Schweine"]
["Nicht ökologisch",null,null,null,"Quaderballen",null,"Legehennen"]
[null,null,null,null,"Stk.",null,"Masthähnchen"]
[null,null,null,null,"ha",null,"Mastputen"]
[null,null,null,null,null,null,"sonst. Mastgeflügel"]